program: Gaussian 09
title: 000264427
version: EM64L-G09RevD.01
frameworkgroup: C1[X(C25H20O)]
method: RPBEPBE
basis: SDD
operation: Freq
keyword: #pfreq=noraman
keyword: PBEPBE/SDD
title: #p freq=noraman PBEPBE/SDD
converged: YES YES NO NO
title: Mulliken charges:
elementType: O C C C C C C C C C C C C C C C C C C C C C C C C C H H H H H H H H H H H H H H H H H H H H
charge: -0.234358 -0.769214 0.400689 0.158064 0.518125 0.336123 -0.005978 0.369924 -0.431647 0.374393 -0.529559 -0.370932 -0.566093 -0.411542 -0.408735 0.453595 -0.421907 -0.236567 -0.256848 -0.419157 -0.215005 -0.438766 -0.406329 -0.813648 -0.244995 -0.237521 0.221853 0.268496 0.238070 0.271769 0.253313 0.262522 0.233627 0.275397 0.239236 0.229995 0.233123 0.244446 0.219446 0.229559 0.241330 0.228040 0.218938 0.236745 0.231418 0.230565
chargesum: 0.00000
title: Mulliken charges with hydrogens summed into heavy atoms:
elementType: O C C C C C C C C C C C C C C C C C C C C C C C C C
charge: -0.234358 -0.278864 0.400689 0.158064 0.518125 0.336123 -0.005978 0.369924 -0.193577 0.374393 -0.257790 -0.108410 -0.312780 -0.177915 -0.133338 0.453595 -0.182671 -0.006572 -0.023726 -0.174711 0.004441 -0.209207 -0.164999 -0.129924 -0.013577 -0.006956
polarizability: 3.35163520e+02 -4.60843975e+01 2.34086357e+02 1.13114336e+01 2.50650301e+01 2.51695558e+02
1716.lowfreq: -53.8353 -9.6706 -2.7853 -0.0007 -0.0006 0.0003 4.7479 12.0214 17.7213
frequency: -53.7928 11.9499 17.5624 25.4227 46.5365 55.9386 62.3631 94.3380 145.1285 151.4426 186.5217 191.8341 201.7494 209.5215 231.9133 270.3679 280.3993 338.9374 359.0734 381.9060 393.5743 401.3065 420.5353 432.8787 459.3959 479.6741 488.3846 510.8886 513.3937 516.7930 550.8946 573.5433 601.0061 623.8512 629.0234 635.0708 671.4259 704.7553 718.8415 727.0965 757.9086 763.5351 766.3378 777.8033 785.0998 795.1896 819.6025 845.7823 849.9273 885.2574 888.1788 900.0263 901.5185 912.4015 917.2871 933.9048 946.4007 959.5636 966.5115 969.3236 979.0310 988.5070 992.6309 994.9616 998.2920 1003.1249 1023.0163 1044.8684 1050.0496 1090.5843 1099.1117 1122.6291 1150.2648 1155.2258 1163.8954 1173.0951 1173.5670 1180.2179 1182.7163 1203.7130 1222.0641 1242.6778 1255.4742 1276.5000 1281.4283 1289.5065 1305.8525 1323.5789 1347.9158 1371.6218 1379.3446 1397.2856 1411.0923 1423.9690 1428.7008 1431.0695 1433.7998 1460.0226 1464.0307 1469.6898 1473.8380 1477.3172 1487.0833 1506.0708 1544.1377 1577.7712 1582.1456 1598.9552 1601.2000 1601.7820 1616.3242 1635.1580 2975.5083 2997.2408 3054.9027 3072.4130 3082.9237 3113.2334 3119.0516 3120.7125 3122.4125 3125.3833 3127.3540 3128.6049 3130.9445 3138.7639 3143.5817 3144.8398 3148.6380 3163.0451 3163.3693 3164.1405
redmass: 1.0193 5.5171 4.0145 4.2843 4.9337 5.1757 5.1184 6.3237 4.2805 5.7053 3.8338 4.6378 4.5423 3.4298 5.1305 3.5937 4.9672 7.1912 3.5963 4.2798 3.2008 2.2348 3.6801 2.9219 4.0946 2.6012 3.7827 6.4174 4.2724 4.2598 4.5454 5.4827 6.0372 5.0774 4.6539 4.4809 5.1314 2.4419 3.3673 2.3339 4.8002 1.5082 1.9839 2.0761 2.3814 2.2837 2.7248 1.6496 2.8473 1.6113 1.6106 2.3590 1.4123 2.4629 2.0272 1.5673 1.9290 2.5232 1.7436 1.4141 1.3475 4.5770 1.3481 1.3329 1.3695 1.6872 2.2749 2.3671 1.5700 2.2101 1.7428 1.7442 1.9046 1.2192 1.6372 1.1091 1.0819 1.0962 1.1115 2.3565 1.9848 1.6198 3.5601 1.8183 1.4108 3.0848 1.5021 1.3210 1.8076 7.4076 5.9914 1.2482 5.4522 2.8926 2.2890 2.3778 4.2407 2.4481 1.2902 1.0633 1.9287 1.4557 1.7391 3.7221 7.9393 6.6778 7.3022 5.6832 5.7391 6.1186 6.2146 6.7250 1.0373 1.0647 1.0971 1.0963 1.0991 1.0855 1.0870 1.0917 1.0860 1.0916 1.0893 1.0887 1.0880 1.0914 1.0937 1.0949 1.0993 1.1003 1.0971 1.0991
irintensity: 0.3173 0.1889 0.1126 0.2154 1.7438 0.3020 0.5196 1.6552 0.4782 1.0035 1.2867 1.3040 7.5253 0.5460 1.5302 2.6493 1.1124 5.0134 1.3729 1.4745 0.6146 0.4013 6.5549 5.7517 4.9114 18.5356 3.1318 0.2219 0.8293 2.3009 1.8501 6.4156 12.3107 2.5966 3.7568 0.9673 16.3603 28.0088 1.7786 33.0758 1.3713 52.8423 35.9216 15.7626 22.7038 30.3550 28.2332 14.2951 16.8205 19.8319 4.3736 11.0546 5.2286 14.6731 20.0310 4.9003 3.3811 6.7399 2.3368 7.5323 0.2319 0.1319 1.0700 0.0869 1.2578 0.3165 5.2153 5.2356 15.0947 10.0732 13.5022 23.4422 12.1633 8.1536 1.0335 2.0794 0.3141 1.6613 0.7651 8.5114 55.3552 31.4149 0.1252 5.0622 10.2655 203.6373 21.6833 2.1775 15.2687 1.7484 1.0726 12.4486 11.6267 1.3552 6.3689 0.8975 1.9659 30.0682 33.9028 19.2089 17.5189 21.2191 18.8988 4.8735 133.2281 3.7151 24.0992 4.6121 10.4764 28.0480 17.3858 17.4945 31.9666 36.1866 23.0106 1.1615 19.0056 0.3838 9.3533 9.2656 2.0635 24.3648 4.5264 7.6372 1.6518 6.7958 27.5829 25.4051 26.1098 33.4216 11.4354 29.7448
temp: 298.150 k
press: 1.00000 atm
elementType: 8 6 6 6 6 6 6 6 6 6 6 6 6 6 6 6 6 6 6 6 6 6 6 6 6 6 1 1 1 1 1 1 1 1 1 1 1 1 1 1 1 1 1 1 1 1
symmnumber: 1
zpe: 966467.6 jmol-1
zpe.correction: 0.368108 hartree
zpe.thermalcorrener: 0.388895 hartree
zpe.thermalcorrenthalpy: 0.389839 hartree
zpe.thermalcorrgfe: 0.315632 hartree
zpe.sumelectzpe: -1038.136549 hartree
zpe.sumelectthermal: -1038.115761 hartree
zpe.sumelectthermalent: -1038.114817 hartree
zpe.sumelectthermalfe: -1038.189025 hartree
dipole: -2.1001 -0.6958 -2.6204
dipole: 3.4294
quadrupole: -133.9911 -145.3116 -147.2487
quadrupole: -6.5921 -5.7419 6.8353
quadrupole: 8.1927 -3.1278 -5.0649 -6.5921 -5.7419 6.8353
hfenergy: -1038.5046567 hartree
pointgroup: C01 [X(C25H20O1)]
dipole: -0.6395096 -0.2803176 -1.154508 debye
polarizability: 349.3216018|23.3119851|206.5466324|-0.562221|10.0266846|265.0772003 unknown
InChI: InChI=1S/C25H20O/c1-18-7-6-8-19(15-18)16-22-11-4-5-12-24(22)25(26)23-14-13-20-9-2-3-10-21(20)17-23/h2-15,17H,16H2,1H3
charge 0 multiplicity 1
46 atoms
O  1.208687 -0.58207 2.380781
C  2.78117 1.607869 1.01296
C  2.986648 0.38335 0.1214
C  2.083247 -0.726557 0.133663
C  1.547524 2.432518 0.630107
C  -0.391888 -1.274833 0.729224
C  0.977018 -0.833616 1.154975
C  -2.176283 -1.522864 -0.95823
C  4.070881 0.354416 -0.787886
C  -3.072773 -2.025808 0.064316
C  -0.839787 -1.159618 -0.596151
C  2.292222 -1.81488 -0.754498
C  0.498412 2.634932 1.557582
C  1.442744 3.018205 -0.659336
C  -1.293332 -1.757455 1.74197
C  -0.649235 3.404575 1.230501
C  -2.592606 -2.129233 1.415093
C  4.282937 -0.738702 -1.659435
C  3.388467 -1.830605 -1.643949
C  -2.653477 -1.403223 -2.30604
C  0.31386 3.7928 -0.997891
C  -0.726954 3.985848 -0.058756
C  -4.407037 -2.395053 -0.303279
C  -1.77039 3.581321 2.240803
C  -3.960176 -1.770648 -2.635355
C  -4.843234 -2.271164 -1.625706
H  3.682983 2.245033 0.936769
H  2.690362 1.285236 2.06346
H  4.765056 1.203328 -0.808067
H  -0.172035 -0.758605 -1.367014
H  0.570399 2.171193 2.549832
H  1.604926 -2.667695 -0.725913
H  2.244606 2.865983 -1.392353
H  -0.921256 -1.814024 2.769784
H  -3.271356 -2.506298 2.189316
H  5.139113 -0.735756 -2.343354
H  3.542568 -2.685984 -2.310463
H  -1.974872 -1.016836 -3.075802
H  0.241616 4.249674 -1.991936
H  -1.602961 4.588098 -0.329021
H  -5.084778 -2.776065 0.469973
H  -1.38155 3.911599 3.221675
H  -2.509823 4.326095 1.898801
H  -2.30648 2.627617 2.409034
H  -4.316534 -1.676572 -3.666759
H  -5.866132 -2.555729 -1.896021
