program: Gaussian 09
title: 000264424
version: EM64L-G09RevD.01
frameworkgroup: C1[X(C25H20O)]
method: RPBEPBE
basis: SDD
operation: Freq
keyword: #pfreq=noraman
keyword: PBEPBE/SDD
title: #p freq=noraman PBEPBE/SDD
converged: YES YES NO NO
title: Mulliken charges:
elementType: O C C C C C C C C C C C C C C C C C C C C C C C C C H H H H H H H H H H H H H H H H H H H H
charge: -0.240090 -0.753148 0.398682 0.393626 0.143588 0.097391 0.409688 -0.413285 -0.383387 -0.386309 -0.470027 -0.014975 -0.244035 -0.357628 -0.440324 0.304011 -0.243310 -0.277760 -0.260051 -0.246167 -0.345713 -0.371878 0.434397 -0.423349 -0.352869 -0.805408 0.221123 0.265293 0.292102 0.257108 0.228619 0.236232 0.224679 0.264134 0.236402 0.230444 0.225060 0.233040 0.226919 0.265470 0.273329 0.235329 0.234336 0.237062 0.234386 0.227262
chargesum: 0.00000
title: Mulliken charges with hydrogens summed into heavy atoms:
elementType: O C C C C C C C C C C C C C C C C C C C C C C C C C
charge: -0.240090 -0.266732 0.398682 0.393626 0.143588 0.097391 0.409688 -0.121183 -0.126280 -0.157690 -0.233796 -0.014975 -0.019356 -0.093493 -0.203921 0.304011 -0.012867 -0.052700 -0.027011 -0.019247 -0.080243 -0.098548 0.434397 -0.188020 -0.118533 -0.106698
polarizability: 4.18413977e+02 -2.25021197e+01 2.55002963e+02 -1.27034210e+00 3.04974938e+01 1.83325876e+02
1716.lowfreq: -6.9663 -0.0007 -0.0004 0.0007 2.9608 7.5067 17.6266 24.9486 30.7527
frequency: 17.6177 24.9158 30.7419 36.2570 49.1568 62.6603 72.8377 100.3175 127.4246 132.9058 159.6073 180.4934 210.5006 223.9760 256.1156 281.0763 296.4229 343.5945 362.9786 384.3460 406.8452 414.6556 420.8723 432.4462 459.7951 473.3575 477.1122 503.3580 510.6564 524.2149 559.9431 575.6107 600.0411 611.0839 634.1567 656.4931 666.3247 691.4978 703.8549 739.0151 745.9934 759.9556 781.3839 785.2748 785.7637 795.7319 808.5707 825.3779 844.7741 857.3219 861.0494 879.0843 889.9217 905.3185 928.2137 943.0284 961.3568 964.2968 976.2398 987.0852 987.6535 993.4915 994.8137 1000.0951 1013.0891 1013.5190 1034.5330 1046.3341 1047.4375 1080.1761 1094.3476 1123.4665 1150.2252 1155.5249 1172.0720 1175.0727 1180.6821 1186.3357 1192.8261 1198.7395 1224.1152 1236.7238 1253.8329 1267.9275 1275.2653 1284.2857 1308.6027 1319.3268 1370.7003 1372.9289 1383.0158 1398.1236 1403.4936 1410.3875 1412.0921 1428.1283 1443.5762 1455.2040 1468.5852 1471.1931 1474.0315 1478.4561 1499.1664 1518.6952 1530.9359 1573.2429 1579.8721 1587.7937 1596.6711 1604.1614 1618.4582 1630.8553 2978.8318 3016.8590 3057.0361 3089.0000 3093.5297 3118.4311 3120.6173 3124.0645 3126.3394 3127.7852 3128.2113 3135.7569 3136.4564 3144.5113 3147.5993 3154.7508 3154.9639 3159.3061 3161.0870 3164.1741
redmass: 4.4942 1.0763 5.1276 4.8798 4.4337 4.3263 4.4955 4.6117 5.1066 5.9195 4.2002 4.1520 4.8628 4.6594 4.4654 4.6605 4.9539 3.2701 4.9679 3.3505 2.8792 3.3097 3.9818 2.3924 3.8164 3.3151 3.1378 6.4035 5.0645 3.6126 4.4990 5.3569 5.6321 3.9091 6.8956 4.3022 4.3907 4.3948 3.9362 3.0240 1.2892 1.9683 2.7329 2.4130 4.7325 3.6810 1.8649 1.8889 1.6599 3.2606 1.3062 1.6375 1.7558 2.8606 3.2153 1.3469 1.4081 1.4153 1.3289 1.4191 1.3387 1.3503 1.3635 1.3621 3.6221 3.0339 2.2484 2.4258 1.5804 2.2653 2.5517 1.3073 1.4665 2.2757 1.1737 1.1026 1.2292 1.1355 1.1676 2.3176 2.9535 1.9288 1.8004 1.8111 2.9937 1.6086 1.3003 1.5068 4.4134 5.6638 2.1707 1.2530 2.8936 3.6723 5.3464 2.1601 2.3629 2.4734 1.0521 1.2357 1.9999 1.1964 2.6216 3.6677 5.7680 6.0875 6.8511 7.4004 5.2459 5.9279 6.2935 6.4541 1.0375 1.0656 1.0972 1.0990 1.0942 1.0859 1.0862 1.0891 1.0852 1.0885 1.0875 1.0890 1.0923 1.0941 1.0945 1.0946 1.0991 1.0960 1.1002 1.1008
irintensity: 0.7664 0.3700 0.6769 0.7776 0.2219 0.3685 0.6619 0.9923 0.7124 1.3201 0.3471 2.8863 1.6919 2.4217 3.4690 2.3485 2.4665 4.5557 2.2250 0.8559 0.1349 5.7252 2.8806 5.9252 1.3340 0.1833 20.5723 0.7813 4.9857 4.9535 0.4723 10.8737 18.0655 4.7574 0.6322 3.5953 12.1941 7.2833 7.4489 19.2083 11.9093 63.5026 11.1158 25.2564 4.3103 13.9584 70.9262 15.9566 22.7011 1.2503 6.9015 11.6629 0.3695 57.3366 25.0843 0.7474 1.5562 0.8077 0.5872 5.5864 0.1044 3.3430 5.9588 3.8620 7.7177 2.5581 4.8757 5.0328 14.3340 13.1594 4.9066 14.8301 0.4985 19.9398 0.7015 1.0899 0.7353 6.8899 40.1860 4.7553 1.8091 4.7947 3.3533 16.6121 316.9752 19.2975 12.9339 21.4133 2.9486 12.1652 16.3132 16.4336 7.8799 14.3855 5.4652 2.3261 8.5849 11.7612 13.7815 4.1525 36.9401 40.0374 2.4687 7.1480 170.1091 17.9209 45.5098 2.3840 7.8696 15.1510 71.9256 0.3004 29.8351 17.2751 17.0476 17.7816 3.0925 1.5044 7.8899 15.2968 3.2900 18.7654 2.7585 5.6828 8.0192 54.4364 14.1202 14.0802 33.8144 4.6399 30.3422 27.4470
temp: 298.150 k
press: 1.00000 atm
elementType: 8 6 6 6 6 6 6 6 6 6 6 6 6 6 6 6 6 6 6 6 6 6 6 6 6 6 1 1 1 1 1 1 1 1 1 1 1 1 1 1 1 1 1 1 1 1
symmnumber: 1
zpe: 967543.4 jmol-1
zpe.correction: 0.368518 hartree
zpe.thermalcorrener: 0.390083 hartree
zpe.thermalcorrenthalpy: 0.391027 hartree
zpe.thermalcorrgfe: 0.315169 hartree
zpe.sumelectzpe: -1038.133800 hartree
zpe.sumelectthermal: -1038.112234 hartree
zpe.sumelectthermalent: -1038.111290 hartree
zpe.sumelectthermalfe: -1038.187148 hartree
dipole: 3.0607 2.4884 0.5999
dipole: 3.9900
quadrupole: -116.3838 -144.2955 -150.4654
quadrupole: -1.8667 2.9710 3.8866
quadrupole: 20.6645 -7.2473 -13.4172 -1.8667 2.9710 3.8866
hfenergy: -1038.5023175 hartree
pointgroup: C01 [X(C25H20O1)]
dipole: 1.224757 -0.2143603 -0.95825 debye
polarizability: 416.461917|21.9413152|176.1166815|20.7787098|16.0399028|264.1642173 unknown
InChI: InChI=1S/C25H20O/c1-18-13-15-20(16-14-18)25(26)24-12-5-3-8-22(24)17-21-10-6-9-19-7-2-4-11-23(19)21/h2-16H,17H2,1H3
charge 0 multiplicity 1
46 atoms
O  1.259612 0.502902 1.695916
C  -0.996732 0.827537 -0.343602
C  -2.258219 0.535599 0.475663
C  -0.250758 -0.441449 -0.774155
C  -3.585256 0.573074 -0.100575
C  1.095816 -0.724839 -0.382234
C  -4.728269 0.271956 0.747071
C  -2.106318 0.211885 1.832314
C  -0.902241 -1.355238 -1.642791
C  -3.842494 0.897904 -1.478065
C  -4.521594 -0.057775 2.125774
C  1.836445 0.11517 0.627091
C  -3.231816 -0.085948 2.657672
C  1.739387 -1.898736 -0.869223
C  -6.050417 0.309806 0.190051
C  3.274228 0.469269 0.385521
C  -0.26278 -2.523766 -2.106415
C  -5.141212 0.928684 -1.99149
C  1.067948 -2.800562 -1.717032
C  -6.259813 0.630891 -1.151474
C  3.859876 0.465098 -0.908591
C  4.065184 0.889528 1.490926
C  5.998434 1.269208 0.014868
C  5.201569 0.86486 -1.086461
C  5.40396 1.273844 1.308417
C  7.44227 1.695511 -0.173009
H  -1.249093 1.405233 -1.250975
H  -0.331456 1.462178 0.260659
H  -1.094339 0.189284 2.252342
H  -1.93467 -1.150414 -1.947045
H  -3.006012 1.135064 -2.143782
H  -5.392168 -0.284814 2.75297
H  -3.073722 -0.334799 3.712942
H  2.764693 -2.115103 -0.550102
H  -6.900316 0.080713 0.844687
H  -0.799435 -3.214874 -2.766108
H  -5.307492 1.183576 -3.044205
H  1.572634 -3.708493 -2.06422
H  -7.274175 0.657454 -1.564546
H  3.260794 0.171011 -1.776588
H  3.598955 0.908333 2.481664
H  5.63618 0.866952 -2.093006
H  6.0030 1.585541 2.17284
H  7.587309 2.75204 0.122079
H  8.122904 1.089864 0.454158
H  7.764697 1.590942 -1.222727
