program: Gaussian 09
title: 000023146
version: EM64L-G09RevD.01
frameworkgroup: C1[X(C20H27NO2)]
method: RPBEPBE
basis: SDD
operation: Freq
keyword: #p
keyword: freq=noraman
keyword: PBEPBE/SDD
title: #p freq=noraman PBEPBE/SDD
converged: YES YES NO NO
title: Mulliken charges:
elementType: O O N C C C C C C C C C C C C C C C C C C C C H H H H H H H H H H H H H H H H H H H H H H H H H H H
charge: -0.407399 -0.228859 -0.101624 0.108632 -0.018739 -0.566967 0.368461 -0.382296 -0.381103 -0.806425 0.063677 0.164605 -0.412976 -0.728564 0.388825 -0.301011 -0.353274 -0.480019 -0.627625 -0.619503 -0.443322 -0.310350 -0.250313 0.211463 0.233813 0.262972 0.232230 0.192216 0.273767 0.193493 0.224446 0.207307 0.268314 0.295073 0.212552 0.216066 0.224204 0.228548 0.248313 0.238255 0.374656 0.221964 0.187777 0.242435 0.231351 0.189024 0.219730 0.237670 0.229431 0.229100
chargesum: 0.00000
title: Mulliken charges with hydrogens summed into heavy atoms:
elementType: O O N C C C C C C C C C C C C C C C C C C C C
charge: -0.032743 -0.228859 -0.101624 0.108632 0.192724 -0.070182 0.368461 0.042150 0.086157 -0.106357 0.063677 0.164605 -0.117903 -0.075743 0.388825 -0.072463 -0.104962 -0.241765 0.024551 0.020602 -0.205652 -0.080918 -0.021214
polarizability: 2.77124756e+02 -4.47166016e+00 2.24892881e+02 2.03900193e+01 2.70972458e+01 1.89060503e+02
1716.lowfreq: -6.1504 -1.1789 -0.0006 -0.0005 -0.0005 10.9082 26.3215 43.4851 52.8502
frequency: 26.0053 43.4484 52.8322 62.9607 67.8578 72.8924 75.5387 106.0350 133.8738 150.5342 169.0081 177.9284 190.3837 202.8867 213.9231 228.7508 235.6636 255.2402 268.8157 280.5848 284.5994 309.7296 316.4081 340.0737 349.1600 365.2990 385.3077 426.3640 435.1772 443.1073 448.7558 478.0621 483.9395 520.0798 525.7101 562.1500 598.7631 604.6992 618.0783 662.0912 666.2402 724.3784 750.0493 765.8677 777.3630 786.1175 792.2242 799.9030 814.6693 828.5022 850.7789 879.7699 897.7662 931.7144 946.9305 956.8407 966.1056 977.3861 989.2693 992.1744 998.7338 1011.4335 1023.2043 1033.0084 1035.6365 1043.6017 1064.3395 1077.2180 1080.1272 1093.2654 1100.1069 1127.4858 1135.5718 1142.5125 1153.1783 1164.9445 1173.2010 1182.0018 1193.5197 1232.3343 1234.8238 1250.7345 1262.0845 1266.2524 1272.7771 1280.1844 1302.2475 1314.3662 1315.4564 1323.9865 1346.7214 1370.2581 1381.3057 1384.2888 1390.7229 1401.9643 1410.5504 1418.7460 1442.4511 1443.4749 1456.4637 1460.3733 1463.0363 1466.1723 1473.7775 1475.9232 1479.8760 1482.2435 1484.5639 1486.2078 1491.9640 1506.1320 1517.4843 1586.3088 1601.3588 1627.7916 1631.7520 2848.5352 2849.5712 2867.7557 2968.3168 2975.4579 2984.9869 2998.7187 3006.5697 3019.1230 3026.7446 3044.8127 3064.3760 3067.5595 3071.8922 3076.1594 3079.9914 3082.2685 3085.0979 3109.2536 3119.7068 3121.2975 3133.0426 3135.8601 3153.9769 3155.4043 3174.5029 3498.9868
redmass: 4.0004 3.7540 4.1376 3.5412 2.9124 4.1819 2.4534 3.3861 4.9434 3.7929 3.5017 3.9145 3.8348 2.7403 1.6947 1.3155 1.0772 2.2306 1.7084 2.2868 2.3996 2.2770 3.1841 2.4344 3.7173 2.1632 3.4916 2.8171 3.1467 2.5110 3.2010 3.2898 3.0395 6.5219 5.2974 3.1439 1.4646 2.9797 3.2610 3.6105 4.2777 3.5005 1.2519 2.7304 1.5309 4.6511 2.1478 3.5787 1.6138 2.2600 2.2521 1.6847 2.8967 2.0317 1.5450 1.2781 1.5056 2.5440 1.7176 1.4343 1.3842 2.8118 2.4167 1.5752 2.3570 2.6909 2.2836 2.1086 2.5777 1.5378 2.0379 2.7893 1.7176 1.7549 1.5042 1.9928 1.5413 1.1763 1.7798 1.4202 2.0399 1.8637 1.4554 1.9953 1.6737 1.7803 1.3486 1.2751 1.3391 1.3334 1.3946 2.2612 1.2874 1.2241 1.1990 2.7790 3.9767 1.1447 1.1753 2.3089 1.7001 1.0827 1.1416 1.1037 1.0526 1.0516 1.0704 1.0655 1.0584 1.0567 1.0884 1.0506 3.5957 6.8248 4.9964 7.4736 6.8784 1.0588 1.0670 1.0602 1.0661 1.0360 1.0408 1.0790 1.0611 1.0728 1.0719 1.0953 1.0939 1.0980 1.0966 1.0992 1.0971 1.0991 1.1003 1.0976 1.0864 1.0858 1.0899 1.0922 1.0990 1.0969 1.0949 1.0638
irintensity: 0.8572 0.2551 0.2731 0.0304 0.2348 0.3919 0.2203 0.0354 0.1801 0.2561 0.1504 0.4656 0.1747 2.2412 0.8331 0.2065 0.2603 0.8514 0.7820 1.6167 1.6383 3.6481 3.9939 0.5805 2.4059 6.2563 4.0589 1.2105 1.5252 6.2598 2.5453 0.1471 4.5747 1.1975 1.5776 19.1106 86.3611 10.7768 25.7018 2.1344 8.3168 30.5986 9.6940 1.1349 2.8687 0.8982 55.4469 3.0702 54.0978 17.1564 12.7700 13.9825 2.1728 23.9538 12.0875 19.6788 8.0669 12.0685 8.3548 0.2757 0.8306 54.7746 48.9654 11.4201 4.7908 1.8213 7.9663 14.2327 103.4376 12.2012 9.4294 21.4242 6.1345 3.2751 2.5646 6.6400 3.7668 1.1255 9.0101 1.1158 4.5774 1.5727 2.5025 6.9157 5.4971 9.0770 20.6816 1.0996 1.8348 1.6321 3.6697 6.8290 4.5972 10.5544 26.1660 4.4104 8.1931 4.2158 2.9751 6.2758 7.4140 12.2858 0.8204 8.2823 4.1408 13.4186 2.8603 19.5193 5.9434 19.2473 4.6629 13.6343 12.7629 10.7488 12.6102 129.7408 51.9129 65.9143 44.6689 263.1523 15.5043 35.2449 29.9433 18.7312 11.7681 34.2657 45.2512 7.8782 2.0686 29.9563 47.5319 13.5967 70.3291 47.9084 38.0235 10.0521 1.3053 5.0799 11.6982 13.2385 23.1170 40.1677 11.5925 24.5130
temp: 298.150 k
press: 1.00000 atm
elementType: 8 8 7 6 6 6 6 6 6 6 6 6 6 6 6 6 6 6 6 6 6 6 6 1 1 1 1 1 1 1 1 1 1 1 1 1 1 1 1 1 1 1 1 1 1 1 1 1 1 1
symmnumber: 1
zpe: 1115858.6 jmol-1
zpe.correction: 0.425008 hartree
zpe.thermalcorrener: 0.448468 hartree
zpe.thermalcorrenthalpy: 0.449412 hartree
zpe.thermalcorrgfe: 0.372804 hartree
zpe.sumelectzpe: -981.778957 hartree
zpe.sumelectthermal: -981.755497 hartree
zpe.sumelectthermalent: -981.754553 hartree
zpe.sumelectthermalfe: -981.831161 hartree
dipole: -0.9027 -1.2577 -0.1084
dipole: 1.5519
quadrupole: -125.1297 -139.7820 -137.4507
quadrupole: -0.6278 0.6757 -1.7029
quadrupole: 8.9911 -5.6612 -3.3299 -0.6278 0.6757 -1.7029
hfenergy: -982.203965 hartree
pointgroup: C01 [X(C20H27N1O2)]
dipole: 0.334116 0.5085649 -0.0499635 debye
polarizability: 276.9923578|-2.7620918|224.1924047|-20.1587512|-28.1453961|189.8933779 unknown
InChI: InChI=1S/C20H27NO2/c1-5-15(2)20(19(22)23,13-14-21(3)4)18-12-8-10-16-9-6-7-11-17(16)18/h6-12,15,22H,5,13-14H2,1-4H3
charge 0 multiplicity 1
50 atoms
O  0.509164 0.287588 2.488116
O  0.414236 -2.012906 2.534989
N  3.779267 1.316314 -0.245305
C  0.639385 -0.839617 0.320861
C  0.222765 -2.221407 -0.373028
C  2.170561 -0.581502 0.0548
C  -0.259403 0.31279 -0.207985
C  0.033286 -2.062405 -1.909776
C  2.798583 0.691992 0.680752
C  1.184195 -3.398494 -0.062227
C  0.497237 -0.963143 1.854359
C  -1.675445 0.382909 0.11698
C  0.272335 1.272333 -1.082464
C  -0.499868 -3.339519 -2.59715
C  -2.484827 1.438911 -0.470289
C  -0.528766 2.305618 -1.655634
C  -2.34493 -0.540186 0.994806
C  -1.885395 2.391184 -1.356936
C  4.976185 0.476697 -0.467018
C  4.148525 2.682008 0.184312
C  -3.884052 1.524416 -0.163933
C  -3.708872 -0.43322 1.275603
C  -4.493692 0.607745 0.691802
H  -0.767095 -2.491147 0.046136
H  2.309747 -0.526183 -1.040442
H  2.718945 -1.474005 0.399637
H  -0.670978 -1.236079 -2.11318
H  0.997722 -1.773798 -2.376517
H  2.017598 1.438922 0.89576
H  3.269104 0.436984 1.664545
H  0.695368 -4.353914 -0.322353
H  2.115423 -3.335637 -0.656006
H  1.438399 -3.44344 1.008137
H  1.334411 1.251986 -1.345572
H  -1.439493 -3.681022 -2.122061
H  -0.715704 -3.142999 -3.663505
H  0.224785 -4.171631 -2.551669
H  -0.06081 3.028291 -2.333048
H  -1.789571 -1.352486 1.469624
H  -2.510777 3.179873 -1.79202
H  0.427333 0.145172 3.470986
H  5.6345 0.958547 -1.21198
H  5.571317 0.311297 0.467744
H  4.683122 -0.51059 -0.862827
H  3.238506 3.30156 0.272666
H  4.682775 2.709321 1.168124
H  4.807945 3.14431 -0.572441
H  -4.468575 2.332226 -0.620965
H  -4.180835 -1.155365 1.951064
H  -5.562931 0.681502 0.918226
