program: Gaussian 09
title: 000264446
version: EM64L-G09RevD.01
frameworkgroup: C1[X(C29H22O)]
method: RPBEPBE
basis: SDD
operation: Freq
keyword: #pfreq=noraman
keyword: PBEPBE/SDD
title: #p freq=noraman PBEPBE/SDD
converged: YES YES NO NO
title: Mulliken charges:
elementType: O C C C C C C C C C C C C C C C C C C C C C C C C C C C C C H H H H H H H H H H H H H H H H H H H H H H
charge: -0.203317 -0.684533 0.295001 0.436713 0.153989 0.104968 0.174866 0.209759 -0.062511 0.315492 0.400031 0.385278 -0.472513 -0.361046 -0.339349 -0.439100 -0.473320 -0.378288 -0.373304 -0.466544 -0.246091 -0.248616 -0.860828 -0.436057 -0.263505 -0.439583 -0.268514 -0.256591 -0.248094 -0.248109 0.249443 0.258822 0.242500 0.258532 0.264277 0.234377 0.238470 0.244075 0.258865 0.238643 0.226957 0.231955 0.234314 0.257974 0.232326 0.239476 0.234482 0.237547 0.225513 0.228093 0.229105 0.227967
chargesum: 0.00000
title: Mulliken charges with hydrogens summed into heavy atoms:
elementType: O C C C C C C C C C C C C C C C C C C C C C C C C C C C C C
charge: -0.203317 -0.176268 0.295001 0.436713 0.153989 0.104968 0.174866 0.209759 -0.062511 0.315492 0.400031 0.385278 -0.230012 -0.102514 -0.075072 -0.204723 -0.234850 -0.134213 -0.114439 -0.227901 -0.019134 -0.016661 -0.136213 -0.196581 -0.029023 -0.202036 -0.043001 -0.028499 -0.018989 -0.020142
polarizability: 4.38130092e+02 6.27576030e+00 3.31885658e+02 9.84922240e+00 2.08792887e+01 2.02235069e+02
1716.lowfreq: -0.0003 0.0006 0.0009 0.6448 5.7365 8.2950 15.9367 19.1002 27.3112
frequency: 15.2905 18.9344 27.2236 41.9677 49.9396 60.3206 83.9466 99.6958 112.9589 125.1992 143.4203 146.2228 159.7916 178.8960 209.1157 227.8386 259.5431 266.5366 291.8427 304.8914 342.2480 359.5010 400.7646 409.8185 420.5259 424.6054 425.2000 452.8287 472.5551 479.6843 490.6511 506.1305 508.2746 511.8771 523.5628 532.7232 579.3608 593.2770 611.7831 628.3923 650.6235 663.2970 681.2932 698.2634 710.4113 721.8801 739.0114 744.9941 756.5301 770.5147 784.3817 789.4448 794.6172 804.6249 818.0714 821.2468 830.5150 865.0573 878.2428 881.4131 886.6164 891.2469 918.0409 930.6147 937.9349 958.8795 962.0030 973.0602 977.3500 985.3394 993.1697 993.2802 1001.6236 1011.7389 1022.5400 1033.0818 1043.8831 1045.3846 1048.1558 1057.7430 1077.3895 1109.2551 1149.5292 1151.8641 1171.9406 1172.2864 1177.8047 1178.7098 1180.2382 1189.8336 1194.4194 1227.5562 1237.5270 1237.5892 1248.5907 1253.2361 1267.6321 1278.5931 1279.7367 1315.5604 1348.5483 1377.7196 1378.5259 1397.0452 1399.3271 1406.2101 1410.2463 1417.8955 1422.9119 1426.7677 1438.1267 1447.3117 1456.1416 1460.2672 1469.0352 1472.7397 1478.5365 1516.0632 1517.0904 1539.0568 1571.0578 1575.5661 1590.0277 1598.7619 1600.0908 1606.8840 1629.3791 1632.9519 2977.0984 3000.5929 3042.4947 3056.7483 3082.7711 3118.5882 3119.1351 3119.9924 3121.7660 3128.0685 3128.3342 3131.1529 3135.7650 3137.9989 3143.3395 3149.6278 3150.2879 3154.7807 3155.1113 3163.7378 3165.2390 3169.6190
redmass: 5.1828 5.0286 5.4010 5.0862 4.7926 4.4895 1.3277 4.0517 5.1506 2.4889 4.1384 4.4708 4.9655 4.0967 5.4285 4.4074 4.0196 3.9729 2.6154 3.9739 5.6506 5.3162 3.9529 3.5418 3.3421 3.3172 3.7847 3.4843 3.2595 3.7194 4.4839 4.3254 3.5089 5.4383 6.5500 3.9356 5.2500 4.0354 4.0064 6.3422 4.2647 4.2781 5.2571 4.0764 4.6514 3.8352 2.3759 1.3382 1.2962 2.7918 3.7320 2.5940 2.1902 2.3132 2.6750 2.4628 1.3340 2.8082 1.7820 2.2805 1.7652 2.7804 1.6228 2.0522 2.8202 1.3413 1.3806 1.4270 1.4004 1.3570 1.3520 1.3426 1.3469 2.1823 3.0964 2.3018 1.7223 2.6848 2.2489 2.5764 2.2646 2.1335 1.4307 1.5297 1.2421 1.2572 1.1113 1.1857 1.2291 1.7086 1.2333 2.9188 1.8042 1.7630 1.7774 2.7035 1.5794 1.7688 1.7668 1.7121 3.3767 5.9345 2.2095 1.2985 3.6089 2.8816 2.7785 5.1052 1.7096 3.5490 1.8905 1.6761 2.5413 2.1899 1.1373 2.1572 1.1199 3.4306 3.8513 8.1027 7.0328 7.0233 7.5455 5.3187 6.1956 5.9531 6.5908 6.5769 1.0372 1.0622 1.0969 1.0974 1.0986 1.0865 1.0862 1.0860 1.0864 1.0883 1.0884 1.0887 1.0895 1.0893 1.0976 1.0942 1.0939 1.0952 1.0991 1.0995 1.1006 1.0985
irintensity: 0.0258 0.0423 0.7951 0.2438 0.6333 0.3069 1.1570 1.2698 0.3763 0.5424 0.1180 0.2654 0.6429 2.4992 5.5895 0.9390 3.1672 2.8709 1.0864 0.8184 3.7296 1.9660 0.7631 4.1613 10.2431 3.9033 0.1537 2.2365 0.4374 10.8231 0.9274 1.1050 1.0879 0.7773 2.1304 10.9389 3.6862 3.0450 2.9294 34.3478 1.0136 11.4697 9.5553 4.6031 3.3601 6.8286 20.8083 5.8874 26.6538 17.7669 11.5424 22.2966 36.1628 68.6992 8.4752 20.1225 61.7485 0.8505 13.1271 24.3116 2.4802 18.0051 5.3522 9.5203 6.5209 0.2557 1.6340 0.6032 3.3117 2.2471 0.8589 0.5798 0.1810 9.5884 9.0873 16.1189 10.4869 2.2653 2.6333 2.1711 8.2018 7.6253 3.0838 2.1912 4.0649 4.0138 0.3610 12.8195 2.1395 2.8799 4.0689 88.6790 0.8934 5.3284 22.5852 102.0708 9.7728 0.4611 12.0454 3.6496 32.1964 6.9865 11.2881 12.7970 3.8551 5.3322 3.6403 2.1445 6.0613 17.2004 7.4323 4.2198 0.5559 10.2187 15.3856 55.3956 16.8326 29.7590 10.3254 123.2274 0.3275 41.7149 1.4594 6.9741 8.6290 19.8824 6.3601 0.3463 29.1845 6.3094 4.4416 12.3145 25.3397 3.9158 3.4348 0.4039 2.6587 9.9826 8.8664 9.9877 10.4840 5.5738 33.9276 49.4591 9.6017 37.1074 38.8903 19.7381 26.0671 19.1978
temp: 298.150 k
press: 1.00000 atm
elementType: 8 6 6 6 6 6 6 6 6 6 6 6 6 6 6 6 6 6 6 6 6 6 6 6 6 6 6 6 6 6 1 1 1 1 1 1 1 1 1 1 1 1 1 1 1 1 1 1 1 1 1 1
symmnumber: 1
zpe: 1087461.0 jmol-1
zpe.correction: 0.414192 hartree
zpe.thermalcorrener: 0.438444 hartree
zpe.thermalcorrenthalpy: 0.439388 hartree
zpe.thermalcorrgfe: 0.358118 hartree
zpe.sumelectzpe: -1191.512617 hartree
zpe.sumelectthermal: -1191.488365 hartree
zpe.sumelectthermalent: -1191.487420 hartree
zpe.sumelectthermalfe: -1191.568690 hartree
dipole: 0.1468 1.2653 2.8977
dipole: 3.1653
quadrupole: -149.4127 -157.7896 -179.7516
quadrupole: -3.8953 -1.6198 0.3391
quadrupole: 12.9053 4.5284 -17.4336 -3.8953 -1.6198 0.3391
hfenergy: -1191.9268086 hartree
pointgroup: C01 [X(C29H22O1)]
dipole: 0.0624328 0.2312559 1.2220888 debye
polarizability: 438.2325693|1.0320887|316.368357|12.2386348|46.5825503|217.6498927 unknown
InChI: InChI=1S/C29H22O/c1-20-17-18-22-10-3-6-15-26(22)28(20)29(30)27-16-7-4-11-24(27)19-23-13-8-12-21-9-2-5-14-25(21)23/h2-18H,19H2,1H3
charge 0 multiplicity 1
52 atoms
O  -1.142169 -0.631989 -1.704998
C  1.564009 -1.040423 -0.93091
C  0.874499 -1.112738 0.437191
C  3.085867 -0.993731 -0.899763
C  -0.497501 -0.731094 0.628913
C  -2.597436 0.556204 -0.190652
C  3.793441 0.1947 -0.472732
C  -3.914049 0.029209 -0.476995
C  -1.377679 -0.290394 -0.502628
C  -2.435507 1.866474 0.308536
C  -5.076004 0.854837 -0.212683
C  5.244699 0.202802 -0.488282
C  3.825763 -2.107513 -1.318413
C  1.597299 -1.578432 1.563297
C  -1.080121 -0.823472 1.925633
C  -3.602031 2.667838 0.539555
C  -4.884255 2.178797 0.296759
C  3.113946 1.381905 -0.035971
C  -4.126572 -1.295636 -0.991586
C  5.954028 -0.965896 -0.9225
C  5.255627 -2.101442 -1.33134
C  1.002571 -1.683912 2.839312
C  -1.066077 2.472422 0.578326
C  -6.388266 0.33461 -0.466234
C  -0.346253 -1.304632 3.025772
C  5.94636 1.383165 -0.07275
C  3.823552 2.517738 0.361503
C  -5.416719 -1.776244 -1.226319
C  -6.560378 -0.957768 -0.962921
C  5.25371 2.520982 0.34461
H  1.16116 -0.181392 -1.497924
H  1.240749 -1.919468 -1.51952
H  3.293057 -3.007112 -1.649516
H  2.647803 -1.858561 1.433657
H  -2.127172 -0.529037 2.055098
H  -3.467591 3.689843 0.912777
H  -5.762097 2.807832 0.487131
H  2.019812 1.394164 -0.009933
H  -3.263407 -1.927511 -1.219634
H  7.05049 -0.949927 -0.930871
H  5.795549 -2.993406 -1.667335
H  1.592242 -2.05695 3.684372
H  -1.151486 3.555916 0.767759
H  -0.582045 2.012176 1.459825
H  -0.381666 2.335566 -0.279225
H  -7.25615 0.972951 -0.261081
H  -0.81638 -1.383191 4.011714
H  7.043023 1.376613 -0.090924
H  3.284921 3.413956 0.68932
H  -5.557014 -2.788208 -1.621939
H  -7.565433 -1.349319 -1.15419
H  5.799383 3.4176 0.658705
