program: Gaussian 09
title: 000256252
version: EM64L-G09RevD.01
frameworkgroup: C1[X(C5H5N5)]
method: RPBEPBE
basis: SDD
operation: Freq
keyword: #p
keyword: freq=noraman
keyword: PBEPBE/SDD
title: #p freq=noraman PBEPBE/SDD
converged: YES YES NO YES
title: Mulliken charges:
elementType: N N N N N C C C C C H H H H H
charge: -0.296261 0.030648 -0.137151 -0.095676 -0.668854 0.299586 -0.393767 0.423659 -0.398642 -0.193053 0.263947 0.244252 0.281909 0.323913 0.315491
chargesum: 0.00000
title: Mulliken charges with hydrogens summed into heavy atoms:
elementType: N N N N N C C C C C
charge: -0.296261 0.030648 -0.137151 -0.095676 -0.029450 0.299586 -0.129820 0.423659 -0.154390 0.088856
polarizability: 1.42378842e+02 2.44075687e+00 8.67890663e+01 -5.61700402e-03 2.31224654e-03 3.66059712e+01
1716.lowfreq: -0.0009 -0.0007 -0.0005 0.9677 1.7598 10.3811 131.5413 226.3079 307.1251
frequency: 131.5411 226.3071 307.1250 331.3880 360.3492 413.7379 435.8664 440.9778 476.9494 624.0444 624.2424 650.9252 711.5920 722.1597 761.2693 819.0919 842.4690 875.6409 901.4164 925.7591 953.1284 1043.1221 1140.8345 1171.9390 1201.8492 1272.7862 1317.4169 1322.5248 1373.8184 1414.3987 1474.3593 1516.0723 1630.0465 1650.0961 3144.4039 3179.7018 3270.4740 3566.5750 3704.0982
redmass: 5.1869 5.0767 3.6981 2.8360 1.2167 1.5346 2.7676 4.3981 6.9481 3.9310 7.6094 5.8239 9.3137 2.1849 2.0641 5.2478 1.6040 1.3708 5.1130 8.1601 3.4620 1.3916 2.0172 3.3100 3.8140 2.2778 6.7350 1.4880 3.6164 5.4812 6.1549 6.8369 3.5770 1.3802 1.0918 1.0934 1.1002 1.0455 1.1042
irintensity: 2.6835 4.9981 5.4339 11.5811 69.4809 153.5117 96.2022 4.9957 0.8072 15.4857 0.6033 2.0565 2.4071 6.7092 23.6620 1.7053 50.1078 8.8236 17.5619 7.9455 10.8365 4.0000 21.0062 1.5707 82.1974 12.3362 14.4797 22.1590 2.4255 50.5038 7.2065 11.0684 80.0613 285.7034 8.7481 5.8524 1.9132 107.8364 30.2988
temp: 298.150 k
press: 1.00000 atm
elementType: 7 7 7 7 7 6 6 6 6 6 1 1 1 1 1
symmnumber: 1
zpe: 280706.7 jmol-1
zpe.correction: 0.106916 hartree
zpe.thermalcorrener: 0.114403 hartree
zpe.thermalcorrenthalpy: 0.115347 hartree
zpe.thermalcorrgfe: 0.075064 hartree
zpe.sumelectzpe: -466.523628 hartree
zpe.sumelectthermal: -466.516141 hartree
zpe.sumelectthermalent: -466.515197 hartree
zpe.sumelectthermalfe: -466.555480 hartree
dipole: 7.9699 1.6629 0.0012
dipole: 8.1415
quadrupole: -51.0557 -58.3248 -60.2081
quadrupole: -10.5325 -0.0025 0.0002
quadrupole: 5.4739 -1.7953 -3.6786 -10.5325 -0.0025 0.0002
hfenergy: -466.6305436 hartree
pointgroup: C01 [X(C5H5N5)]
dipole: 3.1531132 -0.5637188 -0.0004808 debye
dipolederiv: -0.099725 0.0303861 0.0001014 0.5815231 -0.4304509 -0.0000721 0.0002496 0.0001815 0.0661391 0.1583843 -0.2233036 -0.0000694 -0.1692601 -0.1764248 0.0000517 -0.0000557 -0.0000483 -0.1288016 -0.5469655 -0.2985639 -0.0000809 0.2274877 -0.1786898 0.0002468 0.0003668 -0.0000971 -0.2460334 -0.170041 0.1714336 0.0001646 -0.0887678 0.1092533 0.0000144 -0.0000206 0.00022 -0.2464695 -1.5904821 -0.1470688 0.000008 -0.4312251 -0.1257729 -0.000088 0.000015 -0.0000597 -0.7351224 0.5021561 0.1378727 -0.0002963 -0.4837136 0.1365104 -0.000197 -0.0001892 -0.0001156 0.1290021 -0.4773376 -0.1979435 0.0000777 0.3309828 0.1268091 0.0000188 -0.000266 0.0000527 -0.1820943 1.6309016 0.2618261 0.0000115 0.384369 -0.170919 0.0000252 0.0001117 0.0000048 0.1722339 -0.1110816 0.0955605 -0.0000406 -0.3995019 0.3513306 -0.0000535 -0.0000213 -0.0000729 -0.0827277 0.0897098 0.077691 0.0002415 0.020895 0.0022022 0.0000257 -0.0001888 -0.0000556 -0.070209 0.0709793 -0.0367401 -0.0000119 -0.062468 -0.0067542 0.0000099 0.0000255 -0.0000397 0.1799087 -0.0408582 0.0855785 -0.0000012 0.0551009 0.0433622 0.000016 0.000039 0.0000132 0.1401025 0.1216977 0.008022 -0.0000737 -0.0238228 0.042185 -0.0000637 -0.0000249 -0.0000451 0.2132419 0.1986309 0.0374559 -0.0000171 0.090879 0.1390833 0.0000368 -0.0000446 0.0000253 0.3934081 0.2640314 -0.0022066 -0.0000135 -0.0324782 0.1382756 0.0000291 0.0000035 0.0000365 0.3974218 unknown
polarizability: 142.4732213|-0.8377797|86.6946872|0.0055481|0.0024729|36.6059712 unknown
InChI: InChI=1S/C5H5N5/c6-4-1-5-9-7-3-10(5)8-2-4/h1-3H,6H2
charge 0 multiplicity 1
15 atoms
N  -0.718562 -0.695785 0.000436
N  0.26414 -1.663025 0.000558
N  -1.710638 1.353656 0.000829
N  -2.710362 0.333998 -0.000147
N  3.216605 0.576256 0.000212
C  -0.505407 0.715501 0.000137
C  0.83485 1.185864 0.000052
C  1.870269 0.236551 0.00016
C  1.511199 -1.17529 0.000439
C  -2.099887 -0.870684 -0.0003
H  1.018941 2.262833 0.000083
H  2.291557 -1.944662 0.000493
H  -2.585352 -1.840779 -0.000806
H  3.507504 1.549861 0.000109
H  3.938745 -0.138093 0.000344
