program: Gaussian 09
title: 000264441
version: EM64L-G09RevD.01
frameworkgroup: C1[X(C27H24O)]
method: RPBEPBE
basis: SDD
operation: Freq
keyword: #pfreq=noraman
keyword: PBEPBE/SDD
title: #p freq=noraman PBEPBE/SDD
converged: YES YES NO NO
title: Mulliken charges:
elementType: O C C C C C C C C C C C C C C C C C C C C C C C C C C C H H H H H H H H H H H H H H H H H H H H H H H H
charge: -0.210906 -0.684599 0.296595 0.436351 0.154429 0.074154 0.174283 -0.036858 0.346382 0.341039 0.385526 -0.473260 -0.362177 0.482944 -0.346687 -0.624111 -0.618817 -0.378992 -0.466923 -0.246191 -0.249457 -0.867266 -0.832427 -0.263230 -0.439873 -0.268676 -0.815936 -0.248031 0.249222 0.258662 0.242384 0.257546 0.265547 0.238538 0.239445 0.245719 0.238355 0.226571 0.231179 0.229304 0.234033 0.257309 0.267857 0.227048 0.222873 0.233411 0.237219 0.225670 0.224328 0.225126 0.237770 0.227598
chargesum: 0.00000
title: Mulliken charges with hydrogens summed into heavy atoms:
elementType: O C C C C C C C C C C C C C C C C C C C C C C C C C C C
charge: -0.210906 -0.176715 0.296595 0.436351 0.154429 0.074154 0.174283 -0.036858 0.346382 0.341039 0.385526 -0.230876 -0.104631 0.482944 -0.081140 -0.385574 -0.379372 -0.133273 -0.228568 -0.019621 -0.018278 -0.146619 -0.114649 -0.029819 -0.202654 -0.043006 -0.128712 -0.020433
polarizability: 4.00730116e+02 -1.85297568e+01 2.91059679e+02 4.29565777e+00 2.41060132e+01 2.08289132e+02
1716.lowfreq: -8.1549 -5.4657 -0.0006 -0.0002 0.0003 3.5495 12.2228 22.2121 27.0361
frequency: 11.5845 22.1255 27.0337 41.8998 46.8804 50.5303 57.7466 97.4516 114.4133 127.2989 129.7340 141.7508 149.3512 157.6126 178.9196 189.0011 216.4218 226.8774 257.5417 271.3123 274.1306 292.9195 310.8780 342.6749 372.2745 414.2146 417.1000 423.9343 456.1808 472.3780 490.8493 493.4287 506.9773 513.4550 519.9742 525.3425 534.0841 552.8123 570.9867 579.5854 611.1125 614.4304 651.7690 685.2561 693.8372 709.1425 741.7313 746.5773 761.6850 779.9846 787.9364 796.6139 802.8774 818.9476 862.8550 866.3685 879.2055 884.0333 896.5733 902.4555 917.0538 931.0388 938.6251 957.0838 961.6119 974.1623 984.9891 992.8055 1000.4615 1017.2689 1018.8721 1022.2490 1041.9248 1043.0198 1044.9432 1046.4146 1047.1659 1051.2452 1074.1548 1089.5752 1136.5023 1149.5512 1171.1620 1176.5620 1179.8720 1184.8874 1190.0367 1191.5070 1237.3111 1247.3136 1250.3966 1262.5845 1267.5120 1277.6117 1312.0262 1316.6405 1357.0412 1376.9780 1378.0517 1396.0782 1398.2449 1400.8152 1405.9685 1413.0545 1417.8721 1423.1653 1437.1466 1440.0730 1447.7456 1455.9031 1464.2246 1470.8846 1472.1217 1473.4956 1474.6683 1481.2898 1491.8711 1517.0236 1539.7602 1574.5220 1579.0384 1590.0729 1598.4717 1606.3416 1616.2667 1632.7288 2974.6251 2976.3253 2983.9107 3001.7944 3043.5787 3055.8767 3056.0335 3066.8205 3081.8232 3084.9135 3089.3591 3112.7897 3117.7254 3118.5591 3119.7039 3126.8420 3127.4179 3131.5242 3136.2214 3148.8003 3149.6815 3155.0102 3163.8893 3164.0457
redmass: 5.0287 4.3876 4.3579 4.0825 3.8680 1.1085 4.4678 4.5661 2.7538 1.1807 1.5066 3.6645 2.6343 4.0745 4.0525 3.0117 4.3065 2.9337 4.0828 3.1910 3.1343 2.5774 4.0918 4.6511 5.8757 3.5606 3.4304 2.8151 3.2354 3.2527 3.4551 4.8088 5.1375 4.5232 3.2857 4.5988 4.2718 4.4605 4.2976 5.3432 3.8533 3.9374 4.2145 4.5799 4.4188 3.4064 1.5361 1.7826 2.9182 3.3698 4.4114 1.8781 2.5148 1.8154 2.1445 1.5632 1.6534 1.8836 1.3128 4.3346 1.6122 1.8740 2.2551 3.7352 1.3814 1.4224 1.3589 1.3527 1.3405 1.6027 1.6573 3.1016 1.6994 1.6730 2.6449 1.5368 2.1480 1.7014 2.4334 2.8294 2.6320 1.4193 1.1721 1.0946 1.2343 1.5123 1.7407 1.2363 1.8526 1.6796 1.6219 2.3658 1.6624 1.8026 4.2703 1.9681 7.3702 4.5976 2.4986 1.2272 1.3257 1.2435 2.8824 2.3019 5.0538 1.7362 1.9253 2.1456 1.6407 2.5505 1.0633 1.3209 1.1038 1.5125 1.0581 1.1485 1.3924 3.8572 7.5322 6.8096 7.1981 7.5607 5.3221 5.9728 5.8464 6.5823 1.0385 1.0373 1.0373 1.0622 1.0969 1.0966 1.0955 1.0965 1.0988 1.0998 1.1001 1.0910 1.0918 1.0863 1.0860 1.0853 1.0911 1.0887 1.0893 1.0940 1.0943 1.0991 1.1002 1.0999
irintensity: 0.1457 0.2216 0.8122 0.8163 0.5948 0.3338 0.2326 2.0937 0.5887 0.1608 1.5354 0.2578 0.5216 0.6471 1.7545 4.4867 3.0800 0.7004 3.0935 2.6894 4.5611 1.2585 0.9406 0.5666 1.2453 2.0364 6.4477 4.1760 2.9815 0.0228 2.5288 2.1477 3.0658 2.5994 1.9846 1.2302 2.0522 7.9660 3.3632 3.7507 12.3824 5.3674 1.8294 18.3654 1.1420 13.8580 12.4338 15.0747 14.9674 12.7251 4.2027 70.3875 41.3729 22.3649 12.4607 16.0758 2.7357 14.4449 0.0569 68.3966 5.2555 1.7327 0.1460 8.7185 1.5605 0.6966 2.2833 0.9699 0.1538 1.7356 6.2465 9.3928 1.9016 2.1385 2.5426 2.6469 15.9177 18.2449 5.5536 4.9561 1.5008 2.8358 4.4675 1.5747 3.0469 8.6946 15.8514 2.1334 2.0775 21.2327 27.4896 129.0256 40.5234 1.8081 5.3573 15.8900 0.3896 6.0892 11.1851 14.4709 14.8021 10.6028 5.4021 1.9804 2.3736 5.7584 7.9050 49.9150 5.1341 0.5094 17.9319 11.7786 19.0854 49.8034 13.2384 27.5050 10.6795 10.3559 118.9368 39.3285 34.5814 1.4476 5.8137 18.8203 63.4081 0.2891 44.6942 25.8287 20.9655 5.8641 4.5686 0.5404 33.5624 16.6568 24.2437 16.5675 22.2370 24.9682 22.8788 3.2270 0.6367 1.1287 17.2663 10.1067 4.8588 23.9475 32.4099 43.8190 25.8058 21.0871
temp: 298.150 k
press: 1.00000 atm
elementType: 8 6 6 6 6 6 6 6 6 6 6 6 6 6 6 6 6 6 6 6 6 6 6 6 6 6 6 6 1 1 1 1 1 1 1 1 1 1 1 1 1 1 1 1 1 1 1 1 1 1 1 1
symmnumber: 1
zpe: 1108324.5 jmol-1
zpe.correction: 0.422139 hartree
zpe.thermalcorrener: 0.447295 hartree
zpe.thermalcorrenthalpy: 0.448239 hartree
zpe.thermalcorrgfe: 0.364562 hartree
zpe.sumelectzpe: -1116.586340 hartree
zpe.sumelectthermal: -1116.561184 hartree
zpe.sumelectthermalent: -1116.560240 hartree
zpe.sumelectthermalfe: -1116.643917 hartree
dipole: -0.6805 0.9275 2.7280
dipole: 2.9606
quadrupole: -138.9214 -153.3331 -168.3392
quadrupole: -3.6640 -1.1892 0.2800
quadrupole: 14.6098 0.1981 -14.8080 -3.6640 -1.1892 0.2800
hfenergy: -1117.008479 hartree
pointgroup: C01 [X(C27H24O1)]
dipole: 0.2445402 -0.1764254 1.1250845 debye
polarizability: 399.542309|-21.8714377|281.2437536|0.8972032|-37.3546408|219.2928638 unknown
InChI: InChI=1S/C27H24O/c1-18-15-19(2)26(20(3)16-18)27(28)25-14-7-5-10-23(25)17-22-12-8-11-21-9-4-6-13-24(21)22/h4-16H,17H2,1-3H3
charge 0 multiplicity 1
52 atoms
O  1.397137 0.896717 -1.914087
C  -1.308873 1.031777 -1.04064
C  -0.578447 1.278832 0.285602
C  -2.811838 0.810714 -0.934123
C  0.83504 1.071372 0.435559
C  3.039693 -0.018305 -0.404234
C  -3.35576 -0.419196 -0.398539
C  1.71784 0.656612 -0.706442
C  3.072232 -1.302263 0.219516
C  4.251732 0.612227 -0.820416
C  -4.795213 -0.598067 -0.347716
C  -3.695124 1.798483 -1.389645
C  -1.305111 1.739269 1.411564
C  5.541975 -1.310559 0.053251
C  1.454536 1.32373 1.693078
C  4.324883 -1.925579 0.432737
C  5.481597 -0.039006 -0.566886
C  -2.523004 -1.484494 0.084697
C  -5.655141 0.446386 -0.824363
C  -5.113471 1.624713 -1.33673
C  -0.675845 2.005578 2.646879
C  1.800235 -2.034354 0.622738
C  4.245183 1.965475 -1.513171
C  0.714657 1.797595 2.79264
C  -5.334267 -1.820376 0.175286
C  -3.075996 -2.664833 0.587372
C  6.871753 -2.009444 0.274702
C  -4.495115 -2.836907 0.634819
H  -0.829769 0.188168 -1.570034
H  -1.115786 1.899624 -1.698604
H  -3.286444 2.728747 -1.802284
H  -2.385694 1.88734 1.314838
H  2.532712 1.15561 1.790221
H  4.349145 -2.917533 0.901864
H  6.413537 0.456485 -0.86727
H  -1.435272 -1.365567 0.063649
H  -6.741332 0.301481 -0.78237
H  -5.768468 2.421974 -1.704685
H  -1.270609 2.369589 3.492353
H  1.088963 -2.1070 -0.221601
H  2.031306 -3.061123 0.953647
H  1.274335 -1.522059 1.449043
H  3.793074 1.888644 -2.517753
H  3.6496 2.712783 -0.956281
H  5.271157 2.356843 -1.619446
H  1.211629 2.000327 3.74729
H  -6.42372 -1.943712 0.206182
H  -2.421854 -3.465897 0.949562
H  6.833614 -2.687786 1.145215
H  7.688326 -1.284571 0.439444
H  7.149047 -2.620959 -0.606159
H  -4.917284 -3.766805 1.031629
