program: Gaussian 09
title: 000256238
version: EM64L-G09RevD.01
frameworkgroup: C1[X(C20H24O2)]
method: RPBEPBE
basis: SDD
operation: Freq
keyword: #pfreq=noraman
keyword: PBEPBE/SDD
title: #p freq=noraman PBEPBE/SDD
converged: YES YES NO NO
title: Mulliken charges:
elementType: O O C C C C C C C C C C C C C C C C C C C C H H H H H H H H H H H H H H H H H H H H H H H H
charge: -0.180378 -0.268189 -0.125072 0.294660 -0.177026 -0.213634 -0.520094 -0.537032 -0.495410 0.044331 -0.510628 -0.795229 -0.426289 0.292291 0.299036 0.188748 -0.405913 -0.547948 -0.834158 -0.414068 0.323956 -0.535987 0.220534 0.246918 0.228182 0.213275 0.225384 0.226486 0.221566 0.216823 0.204883 0.248475 0.247136 0.228407 0.240273 0.237108 0.227786 0.242518 0.259342 0.224949 0.229665 0.232491 0.239687 0.219141 0.243506 0.219497
chargesum: 0.00000
title: Mulliken charges with hydrogens summed into heavy atoms:
elementType: O O C C C C C C C C C C C C C C C C C C C C
charge: -0.180378 -0.268189 0.095462 0.294660 0.069892 0.014548 -0.081435 -0.088980 -0.073705 0.044331 -0.015017 -0.089441 -0.198503 0.292291 0.299036 0.188748 -0.163395 -0.288605 -0.147052 -0.174380 0.323956 0.146157
polarizability: 3.11970977e+02 -1.23422840e+01 2.16121903e+02 5.28810857e+00 1.60322298e+00 1.36395336e+02
1716.lowfreq: -0.0007 0.0004 0.0008 3.8866 8.4785 14.9855 34.9365 57.0432 78.2848
frequency: 34.9128 57.0246 78.2831 89.8939 104.0166 116.3245 155.4447 167.5261 182.2022 186.7918 203.1266 219.5534 232.8045 243.4201 256.2187 269.5113 278.4421 287.0804 320.3543 365.8558 379.1455 383.8430 405.0074 419.0215 441.4900 479.5525 497.1904 511.4588 522.0970 541.2686 554.8587 569.1483 579.4483 610.6362 644.4037 667.6642 694.7845 707.0923 726.2120 788.3667 809.3641 816.0304 820.3859 835.2492 857.3161 870.5069 888.4913 896.1318 920.9335 934.3307 963.9702 977.9064 989.5339 1000.3499 1004.5105 1011.7132 1029.8260 1045.8948 1050.6425 1058.8656 1074.3213 1080.2619 1112.3426 1117.6936 1122.8246 1135.0685 1146.2559 1153.4106 1171.3313 1182.8803 1192.3093 1198.5710 1208.5718 1228.2279 1239.8452 1247.9111 1250.4775 1258.9542 1273.4652 1279.5258 1291.3679 1295.5254 1311.2055 1320.5051 1328.4891 1343.5900 1350.0587 1370.2843 1383.3626 1385.1429 1397.9184 1420.9440 1426.4478 1439.6398 1460.8106 1465.3937 1465.5888 1471.7695 1473.8514 1474.6589 1477.9775 1487.5381 1490.0477 1491.7363 1570.0975 1620.9839 1651.1778 1654.8089 2891.4144 2908.7801 2928.0216 2956.4511 2970.1096 2977.7969 2981.3353 2987.0485 2999.4057 3007.0750 3031.2778 3042.6778 3044.9590 3048.4794 3056.2082 3071.6321 3079.1409 3084.4201 3087.2730 3106.9174 3122.2559 3140.9545 3163.0686 3165.6372
redmass: 4.2720 4.5897 3.6083 3.3394 3.9532 3.1733 2.9657 1.7637 3.0513 2.4477 1.3989 1.5933 1.3481 2.7477 2.3402 2.9559 2.8687 3.2548 3.0380 3.0143 2.5651 4.1628 3.9508 3.1428 3.8252 2.9202 4.4959 3.7085 3.0330 2.2997 3.3970 4.0884 3.8768 3.9325 3.6387 3.7712 3.4753 3.7771 3.0978 2.1910 1.8259 1.4537 1.7701 1.9523 2.0680 3.9339 1.6041 2.5357 2.0086 1.4498 2.0062 1.9848 1.9653 1.8737 2.6523 3.4943 2.3112 1.7216 2.3667 2.4551 2.1548 2.2221 1.2607 2.0675 1.6243 2.1087 1.4980 1.7827 1.3947 1.9199 1.9432 1.4445 2.2904 1.9469 1.6090 1.9775 1.6856 1.6200 1.3612 1.4159 1.4719 1.4815 1.4639 1.5137 1.3872 1.6598 1.9598 1.5331 5.7817 1.2018 1.2545 2.5676 1.0802 1.3448 1.0751 1.0515 1.0513 1.0894 1.0794 1.0775 1.0722 1.9341 1.2761 1.1236 6.1244 6.7292 7.6273 12.0017 1.0787 1.0795 1.0837 1.0331 1.0375 1.0586 1.0609 1.0389 1.0597 1.0646 1.0993 1.1037 1.0967 1.1014 1.0992 1.1023 1.0994 1.0986 1.0994 1.0907 1.0991 1.0872 1.0921 1.0938
irintensity: 0.0384 3.7233 6.2208 0.2627 4.8869 1.9812 0.1901 0.4599 1.3579 0.7026 0.0562 0.2547 0.6644 0.5423 0.3219 0.8467 1.4570 4.5286 2.9174 2.6902 0.5450 1.7555 1.8960 2.5159 0.6519 0.9563 0.6736 2.7061 6.7868 1.0583 11.1031 2.7547 0.3757 3.2393 4.0073 0.5238 0.8399 5.8655 4.4101 14.3132 29.1014 2.9884 6.0357 14.7762 8.9440 9.0559 32.1869 0.1757 4.8726 1.0189 0.4431 14.1621 9.5985 7.3785 101.0953 21.7803 1.1135 9.8758 25.8241 13.0635 22.6881 1.6627 0.1845 7.1273 2.6122 5.2928 1.2577 1.1694 0.0921 7.3484 122.1299 5.9040 8.9325 23.3830 2.5662 47.7134 10.3788 4.4062 15.4430 11.8453 0.8313 0.9975 4.9276 1.9323 0.9059 3.5354 20.9442 2.8087 12.6651 24.3890 15.0607 46.8248 18.9694 5.3055 6.2429 14.2957 9.0765 11.0198 12.2600 41.0792 11.7738 58.7094 19.3945 1.9475 72.4052 66.6132 2.4544 197.4492 9.0152 2.1727 48.5070 76.5341 35.9583 25.5039 25.5181 19.7106 28.0231 19.5537 35.5306 48.9649 21.2886 38.4995 8.6866 38.0900 18.8119 23.2725 30.7740 23.3660 29.9726 10.3236 11.4335 10.0742
temp: 298.150 k
press: 1.00000 atm
elementType: 8 8 6 6 6 6 6 6 6 6 6 6 6 6 6 6 6 6 6 6 6 6 1 1 1 1 1 1 1 1 1 1 1 1 1 1 1 1 1 1 1 1 1 1 1 1
symmnumber: 1
zpe: 1020420.2 jmol-1
zpe.correction: 0.388658 hartree
zpe.thermalcorrener: 0.408717 hartree
zpe.thermalcorrenthalpy: 0.409661 hartree
zpe.thermalcorrgfe: 0.341538 hartree
zpe.sumelectzpe: -925.337353 hartree
zpe.sumelectthermal: -925.317294 hartree
zpe.sumelectthermalent: -925.316350 hartree
zpe.sumelectthermalfe: -925.384473 hartree
dipole: 2.7181 0.5109 0.9500
dipole: 2.9243
quadrupole: -140.6973 -123.2825 -132.6058
quadrupole: -21.7927 -5.1668 -2.3008
quadrupole: -8.5021 8.9127 -0.4106 -21.7927 -5.1668 -2.3008
hfenergy: -925.7260109 hartree
pointgroup: C01 [X(C20H24O2)]
dipole: -1.0707923 -0.196758 0.3719481 debye
polarizability: 311.8092419|-12.9278748|216.3062218|-5.3333817|-0.9811887|136.3727517 unknown
InChI: InChI=1S/C20H24O2/c1-12-10-17-15(14-5-4-13(22-3)11-16(12)14)8-9-20(2)18(17)6-7-19(20)21/h4-5,10-11,15,17-18H,6-9H2,1-3H3
charge 0 multiplicity 1
46 atoms
O  5.427735 1.244469 -0.524552
O  -5.507638 0.129561 0.273365
C  2.405334 -0.625775 -0.121547
C  3.078963 0.750681 0.168578
C  0.912874 -0.629896 0.260799
C  0.197336 0.490453 -0.561423
C  2.402718 1.844085 -0.684486
C  3.38976 -1.665574 0.477466
C  0.873561 1.878701 -0.409223
C  4.551741 0.429442 -0.148966
C  4.778836 -1.083782 0.082592
C  3.077432 1.149938 1.679983
C  0.217485 -1.956533 0.008112
C  -1.304462 0.472255 -0.266244
C  -1.134561 -2.047264 -0.180404
C  -1.953186 -0.804837 -0.140954
C  -2.091686 1.636795 -0.187228
C  -3.354868 -0.859146 0.028604
C  -1.820135 -3.387309 -0.372137
C  -3.495328 1.58673 0.002129
C  -4.125268 0.325724 0.100476
C  -6.350137 1.323715 0.347689
H  2.44496 -0.760528 -1.228265
H  0.816036 -0.394392 1.3461
H  0.316168 0.185365 -1.629213
H  2.579662 1.627463 -1.757167
H  2.851692 2.834222 -0.481423
H  3.237543 -2.680517 0.071824
H  3.280648 -1.730423 1.576136
H  0.678977 2.275361 0.606869
H  0.408088 2.593049 -1.115632
H  5.150222 -1.519422 -0.865244
H  5.57429 -1.243741 0.832699
H  3.53973 0.378764 2.321779
H  3.652895 2.084354 1.807759
H  2.054294 1.324914 2.052009
H  0.823654 -2.872041 0.031089
H  -1.617761 2.619259 -0.277234
H  -3.879975 -1.814336 0.118921
H  -2.502851 -3.619871 0.468251
H  -1.078797 -4.201821 -0.434639
H  -2.429628 -3.402824 -1.295568
H  -4.066403 2.51777 0.063022
H  -6.077163 1.957781 1.214137
H  -7.375496 0.946089 0.474455
H  -6.285491 1.92219 -0.582297
