program: Gaussian 09
title: 000256230
version: EM64L-G09RevD.01
frameworkgroup: C1[X(C6H8N2O2S)]
method: RPBEPBE
basis: SDD
operation: Freq
keyword: #p
keyword: freq=noraman
keyword: PBEPBE/SDD
title: #p freq=noraman PBEPBE/SDD
converged: NO NO NO NO
title: Mulliken charges:
elementType: S O O N N C C C C C C H H H H H H H H
charge: 0.229038 -0.387717 -0.257839 -0.344770 0.048679 -0.556134 -0.207992 0.185782 -0.661887 -0.454099 0.178828 0.288468 0.288416 0.344571 0.231228 0.231203 0.232305 0.244304 0.367617
chargesum: 0.00000
title: Mulliken charges with hydrogens summed into heavy atoms:
elementType: S O O N N C C C C C C
charge: 0.229038 -0.020099 -0.257839 -0.000199 0.048679 0.020750 -0.207992 0.185782 0.032849 -0.209795 0.178828
polarizability: 1.60242672e+02 4.39995142e+00 1.14980065e+02 -6.41671097e-02 8.23216563e-03 4.97901996e+01
1716.lowfreq: -13.3014 -6.5340 -0.0016 -0.0012 -0.0002 7.7688 35.2897 46.5573 101.1975
frequency: 35.2370 45.8300 101.1974 139.5081 176.3215 192.8590 229.8255 252.1680 266.4198 351.4324 434.2393 440.4701 487.9300 550.1877 561.2399 590.2259 622.0671 635.2638 711.8367 729.1708 773.7681 805.3512 847.0521 925.5694 945.9675 992.6515 1048.4497 1066.6632 1135.3557 1186.0478 1193.2344 1212.7852 1232.0247 1279.6087 1397.4548 1401.0697 1429.6197 1447.8807 1470.4271 1481.6345 1523.3625 1531.2544 1661.4690 2990.1352 3058.2625 3086.7781 3088.8855 3139.3752 3173.9125 3501.8359 3580.2111
redmass: 2.7464 2.6766 4.1741 6.3047 6.3520 6.2628 1.1027 8.0378 3.9485 6.0870 9.7582 1.1269 6.7161 7.9514 8.3283 5.0498 4.7615 2.6357 3.4640 1.6146 1.1161 1.9857 8.0758 7.9135 3.9181 1.8980 1.2201 2.1822 1.6758 3.4585 2.6469 1.7524 1.2220 1.2482 1.2322 2.3462 2.6971 1.1002 1.0392 1.0496 6.4052 8.0355 7.0728 1.0354 1.0603 1.0968 1.1014 1.1086 1.0931 1.0781 1.0657
irintensity: 0.0274 1.6941 0.8249 2.3467 0.4181 23.0881 0.0606 0.7946 0.2627 18.1535 19.7828 121.2123 0.9467 1.6559 2.8071 15.5438 8.1875 44.2276 8.4046 31.8167 12.5470 82.6540 28.7386 30.6821 56.3116 24.9561 0.1636 1.4784 155.9593 70.4412 165.9492 138.0855 0.6909 22.8235 32.6851 27.2758 44.7050 8.8000 16.5188 11.1668 574.8817 178.1465 655.1310 26.9135 2.0907 19.9151 16.9596 15.2329 1.7413 46.6310 52.2916
temp: 298.150 k
press: 1.00000 atm
elementType: 16 8 8 7 7 6 6 6 6 6 6 1 1 1 1 1 1 1 1
symmnumber: 1
zpe: 365827.2 jmol-1
zpe.correction: 0.139336 hartree
zpe.thermalcorrener: 0.150655 hartree
zpe.thermalcorrenthalpy: 0.151599 hartree
zpe.thermalcorrgfe: 0.100837 hartree
zpe.sumelectzpe: -890.628983 hartree
zpe.sumelectthermal: -890.617664 hartree
zpe.sumelectthermalent: -890.616720 hartree
zpe.sumelectthermalfe: -890.667482 hartree
dipole: 2.7096 1.9850 0.0013
dipole: 3.3589
quadrupole: -68.3197 -73.3446 -73.2867
quadrupole: -14.2705 0.0481 0.0147
quadrupole: 3.3306 -1.6942 -1.6364 -14.2705 0.0481 0.0147
hfenergy: -890.768319 hartree
pointgroup: C01 [X(C6H8N2O2S1)]
dipole: 1.0892956 0.7391958 0.1157404 debye
dipolederiv: -0.8766749 0.0174226 -0.0260797 0.1410834 -0.1346815 0.0007597 -0.0123772 -0.0038291 -0.0937611 -0.1567137 0.1517122 0.0253639 0.2032642 -1.4658835 -0.1000084 0.0305624 -0.1026121 -0.4294162 -1.0482126 -0.4259496 -0.066992 -0.6044617 -0.9194835 -0.0766738 -0.0849032 -0.0704981 -0.3855479 -1.4176229 -0.3107217 -0.0730348 0.0711255 -0.4491673 -0.0199869 -0.0328284 -0.0333043 -0.2366296 -1.2318235 0.3670573 0.0019394 1.0392145 -1.0424322 -0.0518652 0.0721555 -0.0750855 -0.1967203 0.4297468 0.20973 0.0337287 0.392847 0.1851186 0.0201331 0.0522953 0.013713 0.1323717 1.5550209 -0.0589374 0.0456323 -0.8659128 1.0050711 0.0668501 -0.0384787 0.0953534 0.0696057 1.6601715 0.4488517 0.0950824 0.5920048 1.2673871 0.1279473 0.1088353 0.1231217 0.2391457 -0.1309248 0.0076691 -0.0071051 -0.1924881 0.0224703 -0.0123497 -0.0284786 -0.0048678 0.0708738 -0.4831054 -0.2524121 -0.032939 -0.4042759 -0.8981322 -0.0764952 -0.0484073 -0.0715279 -0.2950508 1.3784781 -0.1241624 0.0271235 -0.3416763 1.7518007 0.1469342 0.0045033 0.1545237 0.216081 0.0039464 -0.0002029 -0.0421694 -0.0612833 -0.0270882 0.0659945 -0.061832 0.0532954 -0.0015229 -0.0034408 -0.0048309 0.0426415 -0.0676804 -0.0009127 -0.0713093 0.0491079 -0.0540409 -0.0201448 0.1836869 0.0159064 -0.0032575 0.0506378 0.2054475 -0.0115671 0.0000298 -0.0127343 0.3339007 0.0927463 0.0097513 -0.0121869 0.0958914 0.0169905 0.1208454 -0.04869 0.1064424 -0.0388637 0.0858529 0.0134523 0.0262767 0.0907441 0.060477 -0.0928669 0.080313 -0.0847645 -0.0758847 -0.0671544 -0.0956181 -0.0175498 -0.1147696 -0.045479 -0.0227866 -0.0197108 -0.0220985 0.1233913 -0.028124 0.0679193 -0.0007676 0.0464933 0.0455191 -0.0146684 -0.0029296 -0.0138113 0.2013148 0.0541471 -0.0366371 -0.0157068 -0.070758 0.4229782 0.0011132 -0.019167 0.0027247 0.3868573 unknown
polarizability: 160.3402878|2.5598879|114.0377404|4.128569|6.7533859|50.6349083 unknown
InChI: InChI=1S/C6H8N2O2S/c1-2-11-6-7-4(9)3-5(10)8-6/h3,7,10H,2H2,1H3
charge 0 multiplicity 1
19 atoms
S  2.011983 -1.227119 0.009742
O  -1.188848 2.656445 0.301468
O  -3.004956 -1.847095 -0.223513
N  -0.706884 -1.386277 -0.099532
N  0.176191 0.808787 0.158009
C  3.055737 0.350733 0.216814
C  0.343367 -0.503065 0.02772
C  -2.100026 -0.972168 -0.102951
C  4.539835 -0.040445 0.233795
C  -2.251381 0.462556 0.040781
C  -1.122704 1.274305 0.162112
H  2.797122 1.014102 -0.62176
H  2.727392 0.826523 1.152773
H  -0.547874 -2.394974 -0.198123
H  4.775329 -0.718655 1.072884
H  4.845794 -0.529023 -0.708103
H  5.148713 0.873819 0.355221
H  -3.270055 0.859897 0.047762
H  -2.130334 2.964153 0.298704
