program: Gaussian 09
title: 000256225
version: EM64L-G09RevD.01
frameworkgroup: C1[X(C6H4F7NO)]
method: RPBEPBE
basis: SDD
operation: Freq
keyword: #p
keyword: freq=noraman
keyword: PBEPBE/SDD
title: #p freq=noraman PBEPBE/SDD
converged: YES YES NO NO
title: Mulliken charges:
elementType: F F F F F F F O N C C C C C C H H H H
charge: -0.144939 -0.129299 -0.124646 -0.172131 -0.120619 -0.128043 -0.129918 -0.199405 -0.379610 0.255643 0.161102 0.379120 0.177484 0.050238 -0.585517 0.352583 0.270728 0.240119 0.227109
chargesum: 0.00000
title: Mulliken charges with hydrogens summed into heavy atoms:
elementType: F F F F F F F O N C C C C C C
charge: -0.144939 -0.129299 -0.124646 -0.172131 -0.120619 -0.128043 -0.129918 -0.199405 -0.027027 0.255643 0.161102 0.379120 0.177484 0.320966 -0.118289
polarizability: 1.17894591e+02 -4.14071575e+00 6.76308466e+01 -2.18939877e+01 -7.21460452e+00 6.63827949e+01
1716.lowfreq: -9.7601 -5.9052 -2.5321 -0.0014 -0.0013 -0.0009 13.0390 32.0851 65.0116
frequency: 11.6922 32.0134 64.9909 104.0239 130.1131 140.3985 149.8538 183.1104 208.6286 236.8477 264.9226 272.2531 290.8640 302.9988 320.2689 342.3236 388.6262 417.0285 452.3648 483.5802 516.5972 530.3952 576.2134 650.4810 653.6102 680.5013 743.0921 796.6871 876.4538 915.8051 928.3985 994.7803 995.8258 1010.5852 1033.1412 1058.5418 1069.5435 1094.2528 1139.3576 1171.0616 1198.0251 1247.2329 1293.8589 1406.1577 1498.2479 1639.6164 1661.3790 3112.9405 3172.6047 3234.0349 3518.2456
redmass: 8.0419 11.5712 13.2847 5.1787 7.5055 3.4893 4.3626 4.2475 15.7304 13.0461 11.2900 12.6242 16.8521 10.3613 14.4080 13.6663 9.4060 4.9777 14.8484 7.4188 13.7741 12.5609 16.4381 2.0046 2.9144 5.3555 1.6090 7.8815 5.0000 1.3502 2.6198 5.2120 1.2914 8.8033 11.7795 12.5799 10.3491 6.3614 9.5119 3.8653 12.0064 2.6977 1.1788 1.2848 1.6139 10.2431 4.3898 1.0636 1.0955 1.1133 1.0773
irintensity: 2.7028 0.4803 0.2655 2.9386 2.6435 0.5543 0.1830 1.4964 2.6238 7.0867 6.8367 2.5008 0.4367 8.7457 2.0621 2.3861 2.4231 0.5662 15.2749 0.9630 2.3413 13.8513 8.6463 73.7680 19.1120 4.1134 32.7631 65.2393 121.8886 113.7993 48.6217 34.9000 25.6279 48.8794 49.0960 295.4870 117.4666 204.3541 62.0723 40.6542 64.0179 44.8660 10.8232 41.2726 85.5813 290.4710 100.8954 2.9096 5.5794 7.0047 46.6484
temp: 298.150 k
press: 1.00000 atm
elementType: 9 9 9 9 9 9 9 8 7 6 6 6 6 6 6 1 1 1 1
symmnumber: 1
zpe: 270443.2 jmol-1
zpe.correction: 0.103006 hartree
zpe.thermalcorrener: 0.118066 hartree
zpe.thermalcorrenthalpy: 0.119011 hartree
zpe.thermalcorrgfe: 0.058884 hartree
zpe.sumelectzpe: -1058.729965 hartree
zpe.sumelectthermal: -1058.714905 hartree
zpe.sumelectthermalent: -1058.713961 hartree
zpe.sumelectthermalfe: -1058.774087 hartree
dipole: 3.9806 0.8846 -1.8143
dipole: 4.4631
quadrupole: -71.7119 -87.0805 -88.8822
quadrupole: 1.0875 -4.2565 0.3291
quadrupole: 10.8463 -4.5223 -6.3240 1.0875 -4.2565 0.3291
hfenergy: -1058.8329718 hartree
pointgroup: C01 [X(C6H4F7N1O1)]
dipole: 1.5053573 0.229002 0.8744708 debye
dipolederiv: -0.3749813 -0.0823726 -0.0505413 -0.0685558 -0.500674 -0.1402552 -0.080233 -0.2100163 -0.398722 -0.6248509 -0.1893883 0.1212228 -0.1215658 -0.3798419 0.0819087 0.2522839 0.1730362 -0.3510643 -0.4105746 -0.0984909 -0.0754151 -0.1996484 -0.5490759 -0.2088968 -0.0689058 -0.1364968 -0.3283455 -0.4572225 0.0318585 -0.0976152 0.0050048 -0.368588 0.1978424 -0.0036273 0.1452944 -0.6502536 -0.3460949 -0.0828062 -0.1300691 -0.0017573 -0.4842604 -0.1657768 -0.099343 -0.2565859 -0.5200775 -0.5306403 -0.1365937 0.0236979 -0.2110662 -0.5242793 0.1435195 0.110909 0.1649549 -0.339775 -0.7620191 0.2081187 0.1285236 0.2690072 -0.3729536 -0.0626339 0.0735656 -0.0192838 -0.3452005 -0.5851317 -0.0639732 0.0215369 0.0713508 -0.2907308 0.1399923 -0.6177632 -0.1061937 -0.8987466 -1.1951834 -0.2002179 -0.3887254 -0.3202305 -0.3650627 -0.1187597 -0.0785362 0.0116296 -0.4611257 0.9213267 0.3083613 -0.0977163 0.0876138 0.799963 0.0794414 -0.1763254 0.0344695 0.6948685 0.885316 0.0278923 0.275197 0.1971358 0.9853218 0.0243734 0.040542 0.0799497 0.873071 1.6635854 0.0128719 -0.0611266 -0.0626701 1.3802889 0.1235207 0.0008524 0.054466 1.2259907 1.0604153 0.1651864 0.3407681 0.1798755 0.14491 -0.1246777 0.9407975 0.1378547 1.1764902 0.6436844 0.2232819 0.0865084 0.3377056 0.1055716 0.0145294 -0.3427827 -0.1380708 0.0544736 -0.3380082 0.0732743 -0.0688012 0.0607595 -0.3895969 -0.1505421 -0.0372864 -0.1413717 0.0276081 0.2222056 -0.0453286 -0.0333269 -0.046625 0.30938 0.0195785 0.0102999 0.031113 0.201332 0.0974272 -0.0212513 -0.0613296 -0.0486236 0.1642463 0.0134736 0.0347675 0.0512096 0.0372945 0.015602 -0.0814159 0.0379601 -0.0808143 0.1573414 0.0497913 0.0351402 0.0498101 0.0645443 0.1151445 -0.0490066 0.0292519 -0.046896 0.1780406 0.0835712 0.005645 0.0742315 -0.0623623 unknown
polarizability: 116.34904|17.2299689|59.028605|15.8745615|0.580415|76.5305879 unknown
InChI: InChI=1S/C6H4F7NO/c1-2-14-3(15)4(7,8)5(9,10)6(11,12)13/h2,14H,1H2
charge 0 multiplicity 1
19 atoms
F  -0.863274 1.102785 1.453667
F  -2.314689 -0.663888 1.299084
F  -0.592179 -1.99834 -0.422296
F  0.294311 -1.366696 1.590986
F  -2.370931 -0.148692 -1.621596
F  -1.25236 1.779922 -1.157274
F  -3.244158 1.356887 -0.170251
O  0.990958 -0.003614 -1.684427
N  2.172583 0.007258 0.352742
C  -1.336751 0.071901 0.595471
C  -0.12422 -0.880553 0.300049
C  -2.052349 0.767388 -0.617995
C  1.079616 -0.241373 -0.451702
C  3.35827 0.597086 -0.144025
C  4.456782 0.836884 0.615117
H  2.128661 -0.269782 1.338325
H  3.306509 0.845271 -1.208267
H  5.336946 1.299378 0.163884
H  4.511074 0.586876 1.681007
