program: Gaussian 09
title: 000264431
version: EM64L-G09RevD.01
frameworkgroup: C1[X(C26H18OS)]
method: RPBEPBE
basis: SDD
operation: Freq
keyword: #p
keyword: freq=noraman
keyword: PBEPBE/SDD
title: #p freq=noraman PBEPBE/SDD
converged: YES YES NO NO
title: Mulliken charges:
elementType: S O C C C C C C C C C C C C C C C C C C C C C C C C C C H H H H H H H H H H H H H H H H H H
charge: 0.303468 -0.220689 -0.700135 0.302410 0.343452 0.168757 0.170379 0.415846 -0.383911 -0.412488 0.125674 -0.359607 -0.241923 -0.456447 -0.383067 -0.265673 -0.428972 0.594084 -0.395347 -0.406764 -0.241387 -0.252014 -0.271768 -0.241290 -0.414333 -0.265131 -0.231029 -0.231964 0.287795 0.227262 0.234488 0.248539 0.253856 0.236480 0.266720 0.223122 0.235814 0.285520 0.232518 0.233764 0.226422 0.227095 0.245361 0.249676 0.231819 0.233619
chargesum: 0.00000
title: Mulliken charges with hydrogens summed into heavy atoms:
elementType: S O C C C C C C C C C C C C C C C C C C C C C C C C C C
charge: 0.303468 -0.220689 -0.185078 0.302410 0.343452 0.168757 0.170379 0.415846 -0.149424 -0.163949 0.125674 -0.105751 -0.241923 -0.219967 -0.116347 -0.042551 -0.193158 0.594084 -0.109828 -0.406764 -0.008869 -0.018250 -0.045346 -0.014195 -0.168971 -0.015455 0.000790 0.001655
polarizability: 3.61395403e+02 -1.90080318e+01 3.11832469e+02 6.25714178e+01 1.60363303e+01 2.64317792e+02
1716.lowfreq: -7.6823 -6.7337 -3.4126 0.0013 0.0015 0.0020 8.0264 17.3047 24.1968
frequency: 7.7211 16.6779 24.1599 41.2760 55.4118 72.3410 93.2432 106.7979 142.8163 157.6395 175.8030 189.4821 196.4016 211.7547 233.6517 258.5879 288.4991 326.1383 355.5646 391.1350 405.1879 408.9966 409.9379 429.7819 455.7268 470.4814 472.1473 476.3587 503.1591 507.9373 532.1347 540.0497 559.9887 577.5507 592.8749 624.1576 630.6867 658.2667 664.3575 689.7822 703.3406 719.7591 738.2315 741.2936 759.1575 763.1406 779.0274 782.2970 786.5258 805.2397 810.1705 834.2925 856.9523 860.7939 864.9265 873.4295 890.5049 897.4473 912.5340 948.2426 952.8676 962.6572 967.8372 983.2554 988.4563 992.2610 994.3650 1009.0034 1015.3870 1032.3190 1040.6148 1045.6631 1079.4841 1081.0014 1127.4888 1133.0821 1148.8877 1173.1522 1174.3954 1176.5058 1179.2321 1190.4233 1194.9919 1209.6424 1234.0243 1244.3799 1255.6547 1268.6474 1272.6986 1294.2012 1297.1973 1317.0275 1372.4283 1377.8147 1395.8194 1405.3539 1421.5471 1426.4134 1429.4006 1439.0973 1452.8455 1454.4012 1473.6656 1477.3431 1516.9554 1523.5608 1531.9134 1570.0762 1577.6182 1590.5040 1600.3178 1603.1638 1604.2819 1632.6383 2977.9136 3043.3015 3119.3251 3120.6683 3123.6144 3132.0326 3132.6231 3133.7821 3136.5805 3141.1672 3146.6432 3150.0226 3155.1858 3155.4463 3164.4457 3164.6420 3169.5914 3180.3853
redmass: 6.6272 5.0405 6.8666 5.0340 5.2785 5.4603 6.0107 5.1225 4.6438 5.5046 4.1114 6.3889 5.3519 5.0973 4.8035 4.0281 5.4375 8.9712 5.8232 2.3959 3.8309 3.6997 4.8059 3.2544 4.7841 3.2431 4.7681 8.0304 5.6954 6.8151 2.8845 5.2501 3.2433 5.9335 6.7549 5.0197 3.3131 5.6466 5.7393 6.8430 4.8619 3.6228 2.3262 1.2418 4.1413 1.5374 2.0288 2.4798 3.3724 1.8866 2.4990 4.5385 1.6457 2.6123 1.6221 3.7826 1.5670 1.4684 1.5665 1.5941 1.4015 1.3946 1.5350 1.3581 1.3365 1.3505 1.3310 4.7982 2.6402 2.2969 3.6815 2.5749 3.2963 2.2525 1.8356 1.6393 1.4534 1.0975 1.1204 1.0818 1.2213 1.2967 1.1986 2.1729 1.9251 1.9520 1.7477 1.7802 4.3745 1.4663 1.6237 2.4435 5.5369 2.1378 5.5493 2.9808 4.8563 2.5220 2.2364 2.4372 2.2310 2.9704 1.3613 2.2689 3.7655 6.5216 6.7115 6.4398 6.6179 7.2849 5.1024 6.6467 6.1273 6.5255 1.0647 1.0944 1.0862 1.0856 1.0865 1.0859 1.0888 1.0885 1.0915 1.0895 1.0940 1.0943 1.0953 1.0984 1.1007 1.0996 1.1005 1.0944
irintensity: 0.0244 0.0541 1.7194 0.2615 0.3949 0.5694 0.3618 1.0728 0.5553 0.0692 2.4301 1.5259 0.1031 2.2548 3.6453 6.4588 1.6309 7.3262 1.6027 3.2996 3.5113 5.3171 3.7121 5.4870 2.6439 0.0203 11.5740 0.3198 3.4701 0.7001 7.6126 0.6137 5.6150 11.8795 14.8461 1.3401 0.0796 24.9557 3.5873 2.2376 5.5140 36.7012 17.0442 10.5648 5.0641 67.0783 47.5424 25.2679 8.2599 32.6101 82.7800 9.7766 3.8330 1.2917 0.2130 23.2987 3.2117 16.0674 1.8908 2.9087 4.2444 1.5292 0.8979 2.2078 0.0148 0.4665 0.2565 2.4107 1.2030 8.5425 7.0128 2.2131 30.4165 6.3182 13.3152 17.7057 1.5819 14.6900 0.5180 0.3680 4.5301 75.5521 10.0395 2.9340 2.0487 0.6075 2.2327 4.1334 191.0998 1.2724 1.5947 23.6378 4.4488 15.8960 0.5921 5.1699 2.8249 29.0456 7.2766 11.4967 6.0768 7.4614 38.1113 40.4429 0.8749 79.1659 217.2898 12.5851 29.2846 4.8151 8.7593 11.3519 14.7011 0.9548 25.0237 3.6248 0.5983 1.6009 6.4746 0.3370 7.6461 4.2614 21.3831 3.4130 25.2241 39.4788 13.3739 31.8715 34.7499 17.2912 32.4291 2.5838
temp: 298.150 k
press: 1.00000 atm
elementType: 16 8 6 6 6 6 6 6 6 6 6 6 6 6 6 6 6 6 6 6 6 6 6 6 6 6 6 6 1 1 1 1 1 1 1 1 1 1 1 1 1 1 1 1 1 1
symmnumber: 1
zpe: 930355.6 jmol-1
zpe.correction: 0.354354 hartree
zpe.thermalcorrener: 0.376528 hartree
zpe.thermalcorrenthalpy: 0.377472 hartree
zpe.thermalcorrgfe: 0.299652 hartree
zpe.sumelectzpe: -1472.988647 hartree
zpe.sumelectthermal: -1472.966473 hartree
zpe.sumelectthermalent: -1472.965529 hartree
zpe.sumelectthermalfe: -1473.043349 hartree
dipole: 2.0425 0.6895 3.5792
dipole: 4.1783
quadrupole: -148.0168 -152.2250 -167.8339
quadrupole: -3.2978 8.8948 4.4530
quadrupole: 8.0085 3.8002 -11.8087 -3.2978 8.8948 4.4530
hfenergy: -1473.3430009 hartree
pointgroup: C01 [X(C26H18O1S1)]
dipole: -0.0137497 -0.6491058 -1.5102159 debye
polarizability: 325.3035014|-30.2437831|329.3447138|-4.1529368|72.7742483|282.8974481 unknown
InChI: InChI=1S/C26H18OS/c27-26(25-17-21-10-3-6-15-24(21)28-25)23-14-5-2-9-20(23)16-19-12-7-11-18-8-1-4-13-22(18)19/h1-15,17H,16H2
charge 0 multiplicity 1
46 atoms
S  1.671662 -2.643317 1.673588
O  -0.565721 -0.758227 2.350049
C  -1.848155 1.579235 0.899207
C  -0.785677 2.235831 0.007973
C  -2.533382 0.35978 0.299991
C  -0.04499 3.37278 0.515658
C  -1.979904 -0.95688 0.384153
C  0.944818 4.013211 -0.330624
C  -0.522054 1.781722 -1.289985
C  -3.749546 0.528378 -0.406348
C  -0.728024 -1.23594 1.179606
C  -0.252349 3.902056 1.834323
C  0.308972 -2.100076 0.58527
C  1.178454 3.507895 -1.652517
C  -2.662668 -2.050477 -0.215056
C  0.457561 2.411224 -2.120421
C  1.673673 5.142501 0.169869
C  1.661179 -3.324778 -0.937699
C  0.47371 -2.533664 -0.725254
C  2.426039 -3.493068 0.266196
C  -4.427376 -0.561689 -0.996806
C  -3.883505 -1.861342 -0.896071
C  0.472888 5.004119 2.295192
C  1.445114 5.633154 1.456731
C  2.128741 -3.922206 -2.142926
C  3.623751 -4.237758 0.28333
C  3.321359 -4.663964 -2.128819
C  4.064074 -4.821437 -0.922803
H  -1.388862 1.297176 1.863153
H  -2.623341 2.336653 1.131567
H  -1.081073 0.928186 -1.687458
H  -4.170615 1.5373 -0.489649
H  -0.986248 3.431847 2.496009
H  1.929502 3.996922 -2.284365
H  -2.249575 -3.05982 -0.113028
H  0.633956 2.023353 -3.129938
H  2.419425 5.615883 -0.480423
H  -0.227874 -2.274336 -1.521381
H  -5.373416 -0.397681 -1.524427
H  -4.405587 -2.718387 -1.334881
H  0.300422 5.388717 3.306555
H  2.008472 6.495882 1.829033
H  1.557004 -3.799098 -3.069434
H  4.20166 -4.36056 1.204762
H  3.687989 -5.12683 -3.051035
H  4.992316 -5.402969 -0.931464
