program: Gaussian 09
title: 000264404
version: EM64L-G09RevD.01
frameworkgroup: C1[X(C21H18O)]
method: RPBEPBE
basis: SDD
operation: Freq
keyword: #pfreq=noraman
keyword: PBEPBE/SDD
title: #p freq=noraman PBEPBE/SDD
converged: YES YES NO NO
title: Mulliken charges:
elementType: O C C C C C C C C C C C C C C C C C C C C C H H H H H H H H H H H H H H H H H H
charge: -0.239799 0.401100 -0.758113 0.157098 0.499281 0.003713 -0.430356 0.311341 -0.369908 -0.236361 -0.255836 -0.396010 -0.426302 -0.339052 -0.377831 0.434303 -0.424319 -0.354975 -0.226484 -0.225076 -0.248949 -0.806313 0.268784 0.220760 0.237407 0.264381 0.230001 0.232789 0.232091 0.254610 0.263274 0.271343 0.234074 0.232708 0.221155 0.224243 0.225005 0.234143 0.226893 0.235189
chargesum: 0.00000
title: Mulliken charges with hydrogens summed into heavy atoms:
elementType: O C C C C C C C C C C C C C C C C C C C C C
charge: -0.239799 0.401100 -0.268569 0.157098 0.499281 0.003713 -0.192949 0.311341 -0.105527 -0.006360 -0.023048 -0.163920 -0.171692 -0.075778 -0.106488 0.434303 -0.190245 -0.122267 -0.005329 -0.000834 -0.023944 -0.110088
polarizability: 2.65856108e+02 3.87818610e+01 2.12720880e+02 6.34491767e+00 1.47594630e+01 1.92695918e+02
1716.lowfreq: -13.2757 -6.9721 -2.3291 -0.0007 -0.0004 -0.0002 7.7125 17.5872 25.8813
frequency: -12.7264 17.4255 25.5296 45.6847 56.0142 64.2223 72.6796 105.5309 158.2999 161.3488 214.4459 224.3337 242.5059 289.4199 310.9394 342.5869 363.7921 393.8575 404.3537 407.7614 423.4335 448.2530 478.5626 480.5359 548.2451 572.0298 602.1205 611.9059 618.4437 634.2439 670.6394 689.0225 705.0242 737.7680 741.5449 751.9567 783.2742 788.4720 815.6419 824.7248 847.8207 855.2639 861.6923 891.1606 906.6891 922.0326 945.0094 963.9765 975.3901 977.8505 985.7857 990.0762 993.5488 994.9490 995.4252 1014.0772 1026.7690 1044.7137 1047.1918 1078.5383 1098.0184 1123.8263 1153.7095 1169.7386 1174.6844 1182.4151 1188.2210 1193.0568 1195.7251 1213.5111 1223.8802 1276.2031 1284.3203 1309.1296 1310.0198 1337.2281 1370.5820 1371.4952 1382.6882 1396.6479 1410.0838 1428.3757 1440.4693 1466.3349 1468.1340 1471.4539 1474.5319 1483.3033 1500.2488 1537.7780 1575.2520 1582.7237 1592.4259 1601.6769 1612.4408 1618.8505 2978.2340 2996.1097 3056.4520 3074.4259 3087.9234 3114.1929 3119.0417 3123.2197 3123.4737 3127.0028 3132.3126 3135.0674 3144.4413 3145.3075 3154.4042 3158.6605 3161.0430 3163.1895
redmass: 1.0290 5.3649 4.1068 3.9055 4.5554 4.6869 4.4663 5.3074 4.6190 4.9366 4.6324 5.1259 4.8149 4.4850 4.1660 3.1449 5.9091 2.2708 2.8223 2.8406 3.8029 4.0258 3.1480 3.3068 4.5523 4.9585 5.7672 4.3526 5.8541 6.8783 4.4835 4.4219 1.8715 3.3946 2.5097 1.5528 2.1212 3.5910 4.0672 2.6447 1.7431 1.2522 1.2899 1.4323 2.7059 1.9399 2.0271 1.4264 1.3323 1.3933 1.4209 4.2264 1.3644 1.3606 1.4333 2.8316 2.2558 2.4104 1.5785 1.6672 2.2915 1.3109 2.4296 1.0656 1.1075 1.1241 1.2720 1.1703 2.0271 2.4521 2.9493 3.2091 1.4938 1.4349 1.3565 1.3007 4.4320 7.1618 6.9634 1.2548 3.6291 2.1755 2.0937 1.2548 1.0462 1.1706 2.1902 2.0112 2.6377 7.3380 6.1459 6.9533 6.0488 6.0775 6.0604 6.3011 1.0373 1.0652 1.0973 1.0957 1.0989 1.0856 1.0868 1.0867 1.0889 1.0887 1.0880 1.0921 1.0938 1.0960 1.0946 1.0961 1.1015 1.1006
irintensity: 0.3842 0.5021 0.5906 0.4173 0.9638 0.3649 0.8357 1.8382 1.6799 0.2293 0.3773 5.5637 1.6181 2.9244 0.8156 3.0070 2.7140 1.2656 0.0366 0.5911 3.4462 0.2875 24.1904 0.9290 0.6097 4.2110 18.9800 11.0417 2.2682 0.5669 22.1353 11.7661 55.7339 10.4544 24.0896 66.2965 29.5817 7.4661 0.2741 14.7752 16.0627 1.6861 7.4034 0.4505 33.3201 27.6029 2.0031 1.1338 0.4218 0.6652 5.6077 0.1416 5.1133 3.2439 0.3077 3.5322 6.8377 3.5302 13.0388 10.5200 5.5827 14.0345 5.4005 0.2281 2.1263 2.5017 4.7436 27.9649 3.3125 0.9041 1.6756 265.9274 20.7096 24.0173 1.4835 2.0527 1.7968 3.0822 0.1925 15.6202 12.0526 4.0181 5.4943 55.1403 13.0936 9.7043 19.2203 17.1670 0.5036 128.5663 7.1944 30.0170 3.7883 21.2105 4.8841 61.2754 29.4275 34.6772 17.0316 1.0156 17.4563 5.2392 8.1081 0.6656 15.3313 17.0484 5.0762 20.2231 25.7213 36.3530 12.0269 3.2144 23.1653 26.9062
temp: 298.150 k
press: 1.00000 atm
elementType: 8 6 6 6 6 6 6 6 6 6 6 6 6 6 6 6 6 6 6 6 6 6 1 1 1 1 1 1 1 1 1 1 1 1 1 1 1 1 1 1
symmnumber: 1
zpe: 845509.9 jmol-1
zpe.correction: 0.322038 hartree
zpe.thermalcorrener: 0.340129 hartree
zpe.thermalcorrenthalpy: 0.341073 hartree
zpe.thermalcorrgfe: 0.273570 hartree
zpe.sumelectzpe: -884.749917 hartree
zpe.sumelectthermal: -884.731826 hartree
zpe.sumelectthermalent: -884.730882 hartree
zpe.sumelectthermalfe: -884.798384 hartree
dipole: 1.8063 -0.7119 -2.9971
dipole: 3.5710
quadrupole: -108.5404 -123.0089 -127.9884
quadrupole: 6.3501 2.5797 3.8921
quadrupole: 11.3055 -3.1630 -8.1425 6.3501 2.5797 3.8921
hfenergy: -885.0719546 hartree
pointgroup: C01 [X(C21H18O1)]
dipole: 0.4196772 -0.2763454 -1.3120148 debye
polarizability: 284.8083017|-15.1928064|189.1022635|9.6852986|7.3838886|197.3623415 unknown
InChI: InChI=1S/C21H18O/c1-16-11-13-18(14-12-16)21(22)20-10-6-5-9-19(20)15-17-7-3-2-4-8-17/h2-14H,15H2,1H3
charge 0 multiplicity 1
40 atoms
O  -0.154824 -0.832978 2.174409
C  -2.374687 0.289466 0.454382
C  -2.057596 1.381237 1.476773
C  -1.447735 -0.753106 0.133745
C  -0.944125 2.333888 1.028993
C  -0.164775 -0.944978 0.906574
C  -3.60857 0.325353 -0.238731
C  1.091627 -1.315836 0.175994
C  -1.786454 -1.714617 -0.855998
C  -3.94431 -0.641519 -1.214293
C  -3.028376 -1.669704 -1.524937
C  -1.087971 3.109245 -0.151709
C  0.241906 2.473361 1.792813
C  1.295802 -1.017548 -1.197067
C  2.146276 -1.930313 0.905847
C  3.568406 -1.965196 -1.103267
C  2.520869 -1.334741 -1.821728
C  3.357964 -2.2567 0.274037
C  -0.076202 4.008463 -0.554205
C  1.257874 3.37134 1.391189
C  1.102146 4.143659 0.217916
C  4.88285 -2.316861 -1.77496
H  -1.770928 0.914382 2.433465
H  -2.982492 1.963308 1.652937
H  -4.32187 1.124476 -0.002831
H  -1.07907 -2.520098 -1.081031
H  -4.912708 -0.591053 -1.724669
H  -3.276953 -2.428925 -2.274246
H  -1.996724 3.004364 -0.757649
H  0.372175 1.863376 2.694058
H  0.509529 -0.5117 -1.766937
H  1.986929 -2.136312 1.969609
H  2.669465 -1.084759 -2.878869
H  4.157777 -2.740898 0.847841
H  -0.204749 4.60361 -1.465898
H  2.169751 3.464388 1.992148
H  1.88865 4.840756 -0.093029
H  5.073565 -3.405905 -1.7339
H  4.89246 -2.011422 -2.834926
H  5.733998 -1.821402 -1.27115
