program: Gaussian 09
title: 000256214
version: EM64L-G09RevD.01
frameworkgroup: C1[X(C13H13N3O3)]
method: RPBEPBE
basis: SDD
operation: Freq
keyword: #p
keyword: freq=noraman
keyword: PBEPBE/SDD
title: #p freq=noraman PBEPBE/SDD
converged: YES YES NO NO
title: Mulliken charges:
elementType: O O O N N N C C C C C C C C C C C C C H H H H H H H H H H H H H
charge: -0.266497 -0.227518 -0.275621 -0.411042 -0.284995 -0.036495 0.289573 -0.345404 -0.362880 0.161391 -0.217410 -0.227726 -0.220628 -0.260209 -0.140320 0.122413 -0.665290 0.210830 -0.224792 0.275080 0.232644 0.238685 0.235914 0.336023 0.238354 0.365430 0.226819 0.233116 0.302455 0.216220 0.248688 0.233193
chargesum: 0.00000
title: Mulliken charges with hydrogens summed into heavy atoms:
elementType: O O O N N N C C C C C C C C C C C C C
charge: -0.266497 -0.227518 -0.275621 -0.075019 0.080435 -0.036495 0.289573 -0.070325 -0.130236 0.161391 0.021275 0.008188 0.017725 0.199725 0.162136 0.122413 0.032812 0.210830 -0.224792
polarizability: 2.74196602e+02 -1.58968468e+01 1.47396660e+02 -3.53093215e+00 1.92213994e+01 1.22151864e+02
1716.lowfreq: -5.7137 -3.5589 -0.0006 0.0004 0.0006 5.1442 13.3260 24.1188 30.6667
frequency: 13.2063 24.1107 30.5983 48.9663 56.3166 62.4645 93.5162 96.7604 117.3340 135.3621 189.9455 205.7531 225.1326 250.8810 283.6840 300.9148 321.7903 345.7112 379.3794 396.9494 402.0534 444.4856 481.1027 494.5528 496.1859 517.8910 563.7618 613.6578 625.9339 668.6898 689.5152 705.3472 717.5580 724.3570 769.8609 794.9201 816.3731 855.2791 858.3518 860.5507 939.9818 961.1363 987.0683 989.8853 996.4525 1009.1391 1014.3412 1037.8799 1060.5204 1088.5463 1096.7616 1157.5559 1176.6411 1184.3183 1195.1592 1236.7977 1253.8518 1279.5582 1314.4862 1319.2578 1353.8923 1361.6088 1385.7214 1391.4062 1430.2094 1446.5707 1455.9570 1458.1062 1464.5819 1483.3679 1484.8580 1582.7965 1599.3769 1610.3667 1623.1932 1644.3894 2161.3376 2993.3801 3030.2897 3089.1484 3095.0576 3121.0175 3125.3762 3137.3065 3149.5959 3161.1136 3167.3188 3172.9400 3472.7306 3524.8021
redmass: 4.9547 5.2576 6.1308 4.7491 4.1548 5.6341 6.5221 7.3685 3.9193 5.4967 6.7657 3.3249 1.5652 3.8090 2.9350 2.6513 5.1088 5.4252 5.2282 5.1826 2.8990 3.4223 4.1104 3.2113 2.0394 6.8595 2.6992 6.3129 2.1580 6.7301 4.7141 1.5435 7.0648 4.0455 3.8115 2.4006 1.3563 2.6753 2.6166 2.1944 1.4308 1.3255 1.6242 3.6900 2.8248 1.3447 3.7090 2.5349 4.5074 1.6634 2.1535 1.6841 1.0633 1.9278 1.7504 2.1729 3.1704 1.1195 1.7896 1.4315 2.3583 1.7261 9.0877 1.2335 1.9243 1.6241 1.4377 1.1820 1.0464 2.2184 1.0539 6.2510 8.3726 6.0039 8.3001 5.1935 12.6051 1.0362 1.0598 1.0974 1.1030 1.1061 1.0875 1.0875 1.0919 1.0960 1.0935 1.1013 1.0776 1.0788
irintensity: 1.0940 0.8245 0.1279 1.0311 3.1866 2.9593 1.6476 0.9967 3.9797 2.4397 1.9744 8.5099 1.1280 0.3925 21.9991 9.4221 5.6931 4.8227 19.4092 4.8587 0.4135 0.5531 7.8049 26.9004 51.0153 20.1229 60.5379 0.8201 80.3108 8.7381 1.0335 85.6408 30.1649 10.3711 6.9723 23.2412 2.5739 1.3125 14.5846 3.0379 3.1495 17.7087 2.3384 0.3099 16.2164 1.0600 40.1478 15.2344 420.5385 19.4197 21.2497 50.2423 3.1018 122.4529 30.7571 523.7706 94.5698 5.0548 13.6389 1.9615 1.7957 7.4617 1.3443 23.2711 20.5911 142.1403 14.9781 25.9684 14.8023 20.6395 14.9549 31.1953 325.3556 9.8311 86.3883 432.8814 54.3809 20.8454 35.4766 38.6526 1.0541 31.0024 8.8669 2.2153 16.0456 13.6992 4.9210 19.9688 59.0829 25.3105
temp: 298.150 k
press: 1.00000 atm
elementType: 8 8 8 7 7 7 6 6 6 6 6 6 6 6 6 6 6 6 6 1 1 1 1 1 1 1 1 1 1 1 1 1
symmnumber: 1
zpe: 634956.0 jmol-1
zpe.correction: 0.241842 hartree
zpe.thermalcorrener: 0.260644 hartree
zpe.thermalcorrenthalpy: 0.261588 hartree
zpe.thermalcorrgfe: 0.190886 hartree
zpe.sumelectzpe: -891.706815 hartree
zpe.sumelectthermal: -891.688013 hartree
zpe.sumelectthermalent: -891.687068 hartree
zpe.sumelectthermalfe: -891.757771 hartree
dipole: 5.2678 -2.9054 -2.8130
dipole: 6.6411
quadrupole: -79.0155 -124.7667 -108.3390
quadrupole: 9.3660 -7.3284 0.7439
quadrupole: 25.0249 -20.7263 -4.2985 9.3660 -7.3284 0.7439
hfenergy: -891.9486568 hartree
pointgroup: C01 [X(C13H13N3O3)]
dipole: -2.0961905 -1.5124363 0.3811649 debye
polarizability: 273.8090308|15.1750466|157.5948506|10.2727195|-0.323623|112.3412446 unknown
InChI: InChI=1S/C13H13N3O3/c1-2-19-13(18)11(8-14)9-15-16-12(17)10-6-4-3-5-7-10/h3-7,9,15-16H,2H2,1H3
charge 0 multiplicity 1
32 atoms
O  4.846442 -0.172742 0.443766
O  -1.424633 1.453318 -0.819515
O  3.333638 -1.841757 -0.203472
N  -1.156446 0.079215 1.044093
N  0.155038 0.513374 1.259793
N  3.1084 2.510923 1.97251
C  -3.303745 0.045686 -0.149091
C  -4.258215 0.831936 -0.844306
C  -3.685022 -1.217891 0.376363
C  -1.909567 0.591218 -0.03713
C  -5.583165 0.373401 -0.990428
C  -5.011744 -1.675848 0.224883
C  -5.964301 -0.878745 -0.451688
C  5.977881 -0.982854 -0.104196
C  1.218536 -0.203074 0.775887
C  2.544543 0.199442 0.857629
C  6.172272 -0.696854 -1.595716
C  3.571736 -0.716158 0.309935
C  2.887034 1.452696 1.454479
H  -3.937465 1.790443 -1.265268
H  -2.947792 -1.870127 0.859537
H  -6.316788 0.986386 -1.524499
H  -5.298925 -2.655691 0.620857
H  -1.603859 -0.428415 1.810738
H  -6.993155 -1.236247 -0.56834
H  0.283922 1.48721 1.559219
H  6.840422 -0.655358 0.497493
H  5.765881 -2.051214 0.077644
H  0.989282 -1.170054 0.31615
H  7.067469 -1.231955 -1.96365
H  5.301108 -1.041486 -2.177599
H  6.31752 0.382622 -1.772382
