program: Gaussian 09
title: 000256212
version: EM64L-G09RevD.01
frameworkgroup: C1[X(C18H14N2O2)]
method: RPBEPBE
basis: SDD
operation: Freq
keyword: #p
keyword: freq=noraman
keyword: PBEPBE/SDD
title: #p freq=noraman PBEPBE/SDD
converged: YES YES NO NO
title: Mulliken charges:
elementType: O O N N C C C C C C C C C C C C C C C C C C H H H H H H H H H H H H H H
charge: -0.263507 -0.261631 -0.405618 -0.405415 -0.415932 0.030387 0.340350 0.340198 0.632067 0.478650 -0.473832 -0.465828 -0.465666 -0.487869 0.194139 -0.497946 -0.497904 0.154053 -0.207452 -0.207467 -0.327093 -0.203167 0.249379 0.288135 0.288121 0.289359 0.217903 0.217881 0.231584 0.234715 0.234711 0.217639 0.217640 0.251783 0.238830 0.238804
chargesum: 0.00000
title: Mulliken charges with hydrogens summed into heavy atoms:
elementType: O O N N C C C C C C C C C C C C C C C C C C
charge: -0.263507 -0.261631 -0.117483 -0.117294 -0.166553 0.030387 0.340350 0.340198 0.632067 0.478650 -0.184473 -0.247925 -0.247784 -0.256285 0.194139 -0.263231 -0.263193 0.154053 0.010187 0.010173 -0.075311 0.274468
polarizability: 2.70060779e+02 3.98209727e+01 1.97062827e+02 -2.67676805e-01 1.22135412e-01 2.03121856e+02
1716.lowfreq: -39.4731 -2.3263 -0.0003 0.0004 0.0005 4.1114 5.6729 17.1945 31.7504
frequency: -39.4130 17.1438 31.7252 38.6648 119.3805 136.8662 173.9150 203.7124 230.1876 232.5211 261.0201 295.8121 345.4012 407.0801 408.2167 419.4271 426.6098 464.3343 468.3052 474.1623 477.9554 489.2532 508.3108 552.2598 576.0928 604.4255 621.3704 632.1544 633.0003 640.4779 679.0039 726.0336 749.3127 754.1475 756.8127 770.4065 785.2508 807.6024 820.8588 821.4849 830.9530 841.0449 845.6677 877.8565 885.9402 908.6209 926.0428 954.3315 957.0438 966.0781 979.0143 1037.5115 1057.1853 1066.2202 1076.4944 1087.2301 1099.3638 1119.4687 1128.8867 1143.6586 1173.0504 1181.7617 1196.5743 1227.8365 1239.7365 1261.6026 1283.4331 1285.3457 1297.3612 1321.3498 1365.8733 1386.0273 1407.4462 1412.0280 1423.1532 1442.3699 1447.0542 1452.3197 1473.0251 1477.0767 1488.0566 1496.4391 1532.1329 1591.9048 1609.2273 1614.2161 1624.2936 1631.7505 2969.0244 3013.8734 3091.9888 3118.1921 3118.3759 3122.5215 3131.8995 3133.2937 3153.4408 3155.7339 3177.5185 3180.7897 3560.0227 3560.5060
redmass: 2.4223 4.7465 6.4206 5.6955 6.7692 5.0269 4.8794 5.6088 5.7105 4.5981 4.0532 4.2849 4.1221 2.5584 5.1839 4.1931 2.2781 2.0888 4.2589 1.6994 3.6912 6.9910 3.6107 5.8988 5.0299 7.0666 5.1170 4.5065 4.1901 2.9769 9.6606 3.8786 1.3092 6.2382 1.6422 6.1412 5.5857 2.2198 2.0667 3.1350 4.8427 9.6782 1.4265 1.6315 1.4592 4.9426 1.3546 4.1593 1.3183 1.3548 5.2448 3.4142 3.6348 1.4555 2.0676 2.9044 2.0109 1.0365 1.5922 1.8607 1.7879 1.2387 1.3542 1.6664 5.4497 1.2869 1.7512 1.5227 1.7792 1.6609 1.2711 3.5229 1.9007 3.1600 3.8615 4.1588 5.8504 2.0500 2.3974 2.2651 1.2345 1.7417 4.4995 5.0759 7.6140 7.6078 8.1128 6.4735 1.0867 1.0533 1.1190 1.0860 1.0860 1.0897 1.0909 1.0905 1.0996 1.0988 1.0935 1.0950 1.0774 1.0759
irintensity: 13.4775 0.7183 0.2488 0.1601 0.0009 0.0873 6.5315 0.0251 13.3489 0.0724 0.0294 18.8023 0.0010 5.7148 2.2977 6.9451 3.2592 69.4925 8.4139 119.9616 4.2612 4.0973 0.7757 42.7245 5.0227 22.6546 2.7258 9.4228 21.3869 3.6094 2.4398 3.7792 0.0529 70.2235 88.9093 7.4372 3.0600 29.2364 12.9917 71.0502 11.1607 27.5858 0.1228 8.3133 10.0450 8.6508 0.5741 22.0881 0.0034 3.9714 111.7989 15.0986 22.3775 4.1640 21.4478 2.3108 62.3897 0.0001 5.3149 7.3667 5.7726 13.2944 3.3709 0.2207 295.1453 10.5811 8.1914 17.4963 0.0942 42.0608 3.2875 21.6291 9.4690 76.7624 43.9105 51.4396 76.8279 1.9297 132.2957 3.2076 18.6879 62.5070 0.0014 24.6013 3.6348 394.7056 27.9688 39.1422 60.3370 122.1788 29.9737 0.3427 19.7406 11.0961 16.3776 17.4829 48.3663 28.1897 1.3521 7.5852 20.1724 18.2311
temp: 298.150 k
press: 1.00000 atm
elementType: 8 8 7 7 6 6 6 6 6 6 6 6 6 6 6 6 6 6 6 6 6 6 1 1 1 1 1 1 1 1 1 1 1 1 1 1
symmnumber: 1
zpe: 730792.3 jmol-1
zpe.correction: 0.278344 hartree
zpe.thermalcorrener: 0.294291 hartree
zpe.thermalcorrenthalpy: 0.295235 hartree
zpe.thermalcorrgfe: 0.233593 hartree
zpe.sumelectzpe: -952.739008 hartree
zpe.sumelectthermal: -952.723062 hartree
zpe.sumelectthermalent: -952.722117 hartree
zpe.sumelectthermalfe: -952.783759 hartree
dipole: 3.2747 1.2587 -0.0086
dipole: 3.5083
quadrupole: -129.4300 -116.5669 -116.8350
quadrupole: 2.1552 -0.0103 0.0026
quadrupole: -8.4860 4.3771 4.1090 2.1552 -0.0103 0.0026
hfenergy: -953.0173524 hartree
pointgroup: C01 [X(C18H14N2O2)]
dipole: 1.2990674 -0.4664545 -0.002899 debye
polarizability: 271.7934719|-38.160633|195.3280494|-0.2450115|0.0311658|203.1239405 unknown
InChI: InChI=1S/C18H14N2O2/c1-3-11-4-2-6-14-17(11)13(5-1)19-18(20-14)12-7-8-15-16(9-12)22-10-21-15/h1-9,18-20H,10H2
charge 0 multiplicity 1
36 atoms
O  2.976882 2.23932 0.016272
O  5.025997 0.981242 0.004184
N  -0.724609 -1.708483 1.18812
N  -0.72427 -1.696124 -1.205677
C  0.096786 -1.96321 -0.009968
C  -2.206902 -0.177877 -0.00115
C  -1.696303 -0.698717 1.239507
C  -1.695779 -0.685754 -1.246946
C  1.433102 -1.194103 -0.005932
C  -3.244017 0.823581 0.00386
C  1.451998 0.23557 0.004322
C  -2.210217 -0.221496 2.460857
C  -2.209175 -0.195806 -2.463466
C  2.645254 -1.926458 -0.012876
C  2.702376 0.849003 0.006728
C  -3.744395 1.290267 1.264752
C  -3.743874 1.303386 -1.252301
C  3.908748 0.111001 -0.000373
C  -3.234032 0.769173 2.459117
C  -3.233001 0.794775 -2.451822
C  3.915488 -1.284069 -0.010235
C  4.458695 2.358679 0.014102
H  0.350563 -3.043255 -0.015572
H  -0.315548 -2.013948 2.071447
H  -0.314747 -1.992273 -2.091963
H  0.530021 0.822305 0.010044
H  -1.825999 -0.612755 3.41055
H  -1.824547 -0.577138 -3.417023
H  2.607941 -3.022853 -0.020503
H  -4.530585 2.052985 1.278749
H  -4.530062 2.066212 -1.258683
H  -3.620987 1.128356 3.419698
H  -3.619553 1.16396 -3.408768
H  4.85048 -1.849455 -0.015573
H  4.779974 2.871614 0.936868
H  4.776299 2.883343 -0.903346
