program: Gaussian 09
title: 000256211
version: EM64L-G09RevD.01
frameworkgroup: C1[X(C11H15F2N)]
method: RPBEPBE
basis: SDD
operation: Freq
keyword: #p
keyword: freq=noraman
keyword: PBEPBE/SDD
title: #p freq=noraman PBEPBE/SDD
converged: YES YES NO NO
title: Mulliken charges:
elementType: F F N C C C C C C C C C C C H H H H H H H H H H H H H H H
charge: -0.246194 -0.246206 -0.154794 -0.458899 -0.458827 0.447720 -0.362250 -0.362492 -0.189101 -0.189221 0.449209 -0.408411 -0.410624 -0.811188 0.219264 0.278559 0.219767 0.278596 0.215865 0.215976 0.225700 0.200693 0.225484 0.200638 0.223560 0.223593 0.220946 0.221254 0.231383
chargesum: 0.00000
title: Mulliken charges with hydrogens summed into heavy atoms:
elementType: F F N C C C C C C C C C C C
charge: -0.246194 -0.246206 -0.154794 0.038925 0.039536 0.447720 -0.146386 -0.146516 0.237293 0.236901 0.449209 -0.184851 -0.187032 -0.137605
polarizability: 1.81103896e+02 -2.99191368e-01 1.16163720e+02 4.58630673e-01 2.01850628e+01 8.92681642e+01
1716.lowfreq: -37.7571 -9.2936 -6.1318 -0.0014 -0.0011 -0.0009 6.3128 41.2494 43.0946
frequency: -37.2188 40.9341 43.0714 73.0287 79.4820 105.2963 109.2835 139.7095 214.2042 221.3587 278.8931 329.7049 373.9944 379.2620 413.2800 426.1427 454.1185 504.9063 517.9913 555.5255 638.9326 656.3336 708.0635 786.3240 796.1513 798.3809 818.5123 823.5073 903.6142 912.3846 920.3720 946.7595 981.8362 992.4022 999.2931 1000.7302 1037.0747 1045.2336 1073.4862 1102.3332 1137.9774 1186.8207 1189.7717 1200.6340 1204.5337 1234.3737 1247.6010 1278.0708 1321.1666 1357.9544 1359.2718 1367.4292 1374.2647 1376.2290 1390.5582 1396.9383 1423.1733 1459.1002 1459.6789 1464.5657 1471.3681 1474.6579 1486.7203 1523.2284 1569.4446 1635.4408 2967.0172 2994.4243 2997.5373 3012.2887 3013.3773 3046.2389 3064.4083 3070.2150 3076.3550 3095.0541 3095.9048 3114.2193 3116.5602 3152.3911 3157.6547
redmass: 1.0157 6.1098 6.4266 5.1527 4.7470 4.1748 4.1794 2.7912 4.0678 4.0895 3.4922 4.3102 2.6786 2.6857 2.9609 4.6142 2.2847 2.4116 1.8269 2.8876 6.7959 3.5574 2.7748 4.2478 1.7826 1.2981 3.4057 3.0592 2.8740 2.0661 1.3200 1.3565 1.5416 2.4871 2.6227 2.6219 3.1214 1.5245 1.9434 2.0591 1.4028 1.1073 1.2177 2.1494 1.1495 2.6347 1.3743 1.3835 1.3614 1.2828 1.3470 3.4178 1.4619 1.4682 1.6669 1.2375 3.0516 1.0888 1.0926 1.1101 1.0506 1.1111 1.1388 2.7960 5.8004 6.4245 1.0389 1.0632 1.0638 1.0590 1.0593 1.0947 1.0988 1.0988 1.0994 1.1087 1.1077 1.0888 1.0885 1.0928 1.0938
irintensity: 0.6366 1.1096 0.1413 0.0855 10.3574 8.9154 3.7274 4.3266 0.9038 6.4322 3.6312 1.0957 0.3341 0.6430 0.6670 1.8993 20.4147 26.4803 3.8556 8.4688 0.0022 1.4375 0.8103 2.5951 72.5045 1.3242 5.1096 30.3034 41.3374 7.4053 0.8300 0.0577 3.7354 42.4660 43.1247 17.3304 0.3699 17.1167 5.7623 7.8096 2.2990 12.2305 7.0927 33.0829 5.9844 0.1536 68.2136 14.3592 3.3302 0.4401 3.9571 6.2248 7.1579 93.2262 12.5911 12.3024 13.2787 0.5598 16.1632 24.7767 11.9829 10.6700 0.0989 248.4502 7.9386 96.7419 62.0294 25.9449 6.0141 111.2160 2.9900 26.7880 8.2478 0.5304 20.3954 20.6907 70.4559 14.5039 29.7801 41.1288 8.1870
temp: 298.150 k
press: 1.00000 atm
elementType: 9 9 7 6 6 6 6 6 6 6 6 6 6 6 1 1 1 1 1 1 1 1 1 1 1 1 1 1 1
symmnumber: 1
zpe: 626643.0 jmol-1
zpe.correction: 0.238676 hartree
zpe.thermalcorrener: 0.252383 hartree
zpe.thermalcorrenthalpy: 0.253327 hartree
zpe.thermalcorrgfe: 0.196823 hartree
zpe.sumelectzpe: -681.522057 hartree
zpe.sumelectthermal: -681.508350 hartree
zpe.sumelectthermalent: -681.507406 hartree
zpe.sumelectthermalfe: -681.563909 hartree
dipole: -1.3021 0.0326 -0.0366
dipole: 1.3031
quadrupole: -87.5747 -76.0647 -86.2131
quadrupole: -0.1214 0.1610 12.2228
quadrupole: -4.2905 7.2195 -2.9290 -0.1214 0.1610 12.2228
hfenergy: -681.7607329 hartree
pointgroup: C01 [X(C11H15F2N1)]
dipole: -0.512273 0.0151076 -0.0131448 debye
polarizability: 181.1023033|-0.496361|113.4843986|0.4299939|21.7331644|91.9490787 unknown
InChI: InChI=1S/C11H15F2N/c1-10-2-4-11(5-3-10)14(8-6-12)9-7-13/h2-5H,6-9H2,1H3
charge 0 multiplicity 1
29 atoms
F  3.078103 2.093036 -0.986624
F  3.092154 -2.102459 0.974028
N  1.15265 -0.00595 0.004172
C  1.922025 0.93977 0.82228
C  1.917814 -0.948233 -0.822083
C  -0.257214 -0.004895 0.006414
C  -1.004099 0.973248 0.734916
C  -1.008091 -0.984877 -0.71556
C  2.159566 2.294288 0.145748
C  2.163261 -2.303477 -0.149918
C  -3.158512 -0.002839 0.011734
C  -2.413207 0.960665 0.735769
C  -2.417231 -0.971895 -0.708927
C  -4.677381 0.01727 -0.011559
H  1.420172 1.106237 1.795277
H  2.900668 0.485449 1.054952
H  1.408891 -1.113116 -1.791555
H  2.893999 -0.491836 -1.061303
H  -0.494297 1.753599 1.307909
H  -0.50167 -1.773306 -1.280315
H  1.234088 2.724024 -0.274554
H  2.654846 3.008953 0.829724
H  1.242481 -2.73509 0.278611
H  2.653104 -3.016599 -0.83945
H  -2.94517 1.728666 1.311937
H  -2.952721 -1.744675 -1.275283
H  -5.09278 -0.995473 -0.161796
H  -5.092139 0.415339 0.932001
H  -5.063109 0.653776 -0.832545
