program: Gaussian 09
title: 000264379
version: EM64L-G09RevD.01
frameworkgroup: C1[X(C16H12OS2)]
method: RPBEPBE
basis: SDD
operation: Freq
keyword: #p
keyword: freq=noraman
keyword: PBEPBE/SDD
title: #p freq=noraman PBEPBE/SDD
converged: YES YES NO NO
title: Mulliken charges:
elementType: S S O C C C C C C C C C C C C C C C C H H H H H H H H H H H H
charge: 0.255762 0.323060 -0.251931 -0.723746 0.631854 0.483706 -0.477089 -0.275089 0.281749 -0.387926 -0.403847 -0.522034 -0.293009 -0.227043 -0.229991 -0.245307 -0.250716 -0.138877 -0.518688 0.218177 0.273261 0.253907 0.221061 0.265948 0.270949 0.221695 0.225653 0.226093 0.272441 0.250509 0.269467
chargesum: 0.00000
title: Mulliken charges with hydrogens summed into heavy atoms:
elementType: S S O C C C C C C C C C C C C C C C C
charge: 0.255762 0.323060 -0.251931 -0.232308 0.631854 0.483706 -0.477089 -0.021181 0.281749 -0.166864 -0.137899 -0.251085 -0.293009 -0.005348 -0.004338 -0.019214 0.021725 0.111632 -0.249222
polarizability: 2.40126069e+02 3.66757078e+01 2.20519885e+02 -6.56890743e+00 1.45115822e+01 1.55685729e+02
1716.lowfreq: -9.7424 -7.4890 -0.0025 -0.0022 0.0008 1.7219 12.3554 26.3344 38.6950
frequency: 11.9562 26.3274 38.6763 54.9490 61.6822 105.2656 135.3255 167.3215 178.9732 213.3297 218.3870 276.6031 316.4204 365.7245 380.2852 403.7573 431.8891 447.9369 457.5991 506.3945 543.5012 553.3503 565.4163 616.3435 644.7275 648.8491 677.5027 690.2699 706.8471 720.0429 722.0272 750.9771 754.6252 779.2984 800.6880 821.1035 841.2760 849.0695 854.6206 895.0337 907.7582 922.0328 923.6906 960.6670 977.6116 990.0636 996.2079 1027.0680 1039.3363 1071.3465 1080.5090 1091.2549 1122.9052 1160.8890 1171.4285 1189.5004 1201.3160 1224.6047 1231.9505 1285.9675 1299.5014 1334.7006 1339.9867 1367.7289 1381.8269 1439.0525 1450.9540 1453.8804 1460.5896 1482.2649 1494.1996 1524.6091 1536.8099 1593.0730 1611.6596 3002.6366 3090.3974 3111.2941 3124.1896 3136.5642 3149.7896 3162.8230 3169.9707 3176.2569 3193.6889 3232.9060 3233.2899
redmass: 5.3960 5.1205 5.9538 6.3408 6.4363 5.6531 7.2554 5.2906 6.2329 10.0403 5.3488 6.8515 3.9170 9.1556 2.4647 2.8310 6.0901 5.5962 3.8759 7.8827 5.8413 4.6047 3.3702 6.3208 6.0544 8.0276 3.4901 7.2043 1.6651 1.9518 1.2380 3.2940 2.2263 4.8835 4.9588 3.1018 5.1141 1.3526 1.2519 1.5103 1.9659 1.4786 1.4541 2.8881 1.3964 4.7016 1.4056 2.2612 2.3459 1.6148 1.5609 1.1216 1.5512 1.3679 1.0606 1.1927 2.4808 1.5562 1.4651 4.2566 1.3713 1.2823 2.4271 3.7170 7.2882 2.2749 5.1258 6.4181 1.3177 2.4092 4.1874 5.8313 6.4103 6.0154 6.0425 1.0654 1.0963 1.0866 1.0867 1.0925 1.0955 1.1011 1.0924 1.0897 1.0976 1.1002 1.0993
irintensity: 0.0864 2.3014 0.3045 0.1262 3.0934 1.2849 0.5029 0.3028 0.5649 4.3920 1.8709 1.0494 0.3613 8.6648 1.6896 0.0280 0.8429 0.6007 2.3140 0.1515 7.3142 24.5778 3.5551 0.0896 3.3110 11.2213 28.4135 2.0745 75.3568 34.8855 67.0935 39.3275 47.9582 65.7956 19.4357 8.7515 8.5288 2.4019 1.0606 6.7276 2.3266 1.0199 1.8908 12.8968 1.3889 0.1421 1.9691 9.2129 13.6672 17.1012 8.8467 0.8820 7.1790 4.9243 0.2471 3.9985 2.1288 6.6980 11.0624 216.8432 11.4962 1.1656 19.3884 6.0494 2.4424 3.9111 180.0168 61.5023 58.5658 39.9447 43.6367 5.2446 161.5885 0.9995 8.4562 34.8607 0.6833 8.8620 1.2688 27.5464 25.6963 19.2291 6.9696 6.1654 1.3456 0.6459 0.1781
temp: 298.150 k
press: 1.00000 atm
elementType: 16 16 8 6 6 6 6 6 6 6 6 6 6 6 6 6 6 6 6 1 1 1 1 1 1 1 1 1 1 1 1
symmnumber: 1
zpe: 600316.8 jmol-1
zpe.correction: 0.228649 hartree
zpe.thermalcorrener: 0.245208 hartree
zpe.thermalcorrenthalpy: 0.246152 hartree
zpe.thermalcorrgfe: 0.181055 hartree
zpe.sumelectzpe: -1486.906064 hartree
zpe.sumelectthermal: -1486.889504 hartree
zpe.sumelectthermalent: -1486.888560 hartree
zpe.sumelectthermalfe: -1486.953658 hartree
dipole: -0.4454 1.9030 2.9482
dipole: 3.5372
quadrupole: -111.3307 -112.1675 -125.4939
quadrupole: 9.3756 -4.2444 -0.7676
quadrupole: 5.0000 4.1632 -9.1632 9.3756 -4.2444 -0.7676
hfenergy: -1487.1347126 hartree
pointgroup: C01 [X(C16H12O1S2)]
dipole: 0.1453754 0.4504254 -1.3086795 debye
polarizability: 235.148509|-39.9855134|215.4826519|-2.8823556|-25.7558446|165.7005222 unknown
InChI: InChI=1S/C16H12OS2/c17-15(14-7-4-9-18-14)16-13(8-10-19-16)11-12-5-2-1-3-6-12/h1-10H,11H2
charge 0 multiplicity 1
31 atoms
S  1.392194 2.32747 -1.205027
S  3.505794 -1.589147 0.976701
O  0.928615 -0.313775 1.804147
C  -1.697905 1.051868 1.278397
C  -0.715015 1.711898 0.318164
C  -2.406099 -0.162215 0.665909
C  0.576505 1.243535 0.019515
C  -1.056929 2.899344 -0.423971
C  1.290499 0.110492 0.650656
C  -3.400376 0.007727 -0.332367
C  -2.080533 -1.476496 1.088066
C  -0.05683 3.360903 -1.265517
C  2.426276 -0.537732 -0.036709
C  -4.057188 -1.108282 -0.896314
C  -2.735531 -2.59511 0.522954
C  -3.725567 -2.416096 -0.47011
C  2.812504 -0.583455 -1.379738
C  3.957732 -1.413224 -1.626575
C  4.453376 -2.011814 -0.473781
H  -2.452287 1.80893 1.564388
H  -1.160489 0.739827 2.187138
H  -2.02115 3.403035 -0.315143
H  -3.663552 1.018789 -0.668975
H  -1.306196 -1.616206 1.850352
H  -0.056476 4.239516 -1.908578
H  -4.826382 -0.960069 -1.663207
H  -2.47347 -3.604567 0.860054
H  -4.234941 -3.283457 -0.905237
H  2.269454 -0.06423 -2.171952
H  4.39279 -1.565621 -2.616916
H  5.308975 -2.678039 -0.372123
