program: Gaussian 09
title: 000264366
version: EM64L-G09RevD.01
frameworkgroup: C1[X(C11H13N3O5)]
method: RPBEPBE
basis: SDD
operation: Freq
keyword: #p
keyword: freq=noraman
keyword: PBEPBE/SDD
title: #p freq=noraman PBEPBE/SDD
converged: YES YES NO NO
title: Mulliken charges:
elementType: O O O O O N N N C C C C C C C C C C C H H H H H H H H H H H H H
charge: -0.248515 -0.444975 -0.471904 -0.499482 -0.233033 -0.166434 -0.380387 -0.005770 -0.147636 -0.176641 -0.164497 -0.036871 -0.395455 0.363191 -0.204059 0.035750 -0.394368 -0.012140 -0.247379 0.283171 0.267836 0.241669 0.254598 0.258401 0.235508 0.310988 0.351977 0.388060 0.276608 0.343312 0.378944 0.239532
chargesum: 0.00000
title: Mulliken charges with hydrogens summed into heavy atoms:
elementType: O O O O O N N N C C C C C C C C C C C
charge: -0.248515 -0.092998 -0.083843 -0.120538 -0.233033 -0.166434 -0.037075 -0.005770 0.135535 0.091196 0.077172 0.217727 0.098454 0.363191 0.106929 0.035750 -0.117760 -0.012140 -0.007848
polarizability: 1.98370622e+02 1.29267954e+01 1.37979196e+02 -8.62520481e+00 2.01902178e+01 1.20428048e+02
1716.lowfreq: -16.4554 -12.9852 -7.5752 -3.1915 -0.0001 0.0004 0.0006 32.5627 66.3732
frequency: -10.7758 32.4158 66.3118 81.3663 110.6113 122.9926 164.3847 186.4595 203.4617 227.1198 259.7711 270.2944 287.2324 299.3244 319.0047 330.8240 371.0685 395.2801 413.8669 448.5033 491.7436 496.9765 545.4946 555.2537 564.8278 594.5326 608.0715 647.2232 673.6585 706.8236 719.5348 737.6985 741.1318 779.2202 794.2543 803.5401 864.5765 872.1949 884.2997 887.4998 926.0347 941.6079 951.6197 967.3961 981.7527 1007.8542 1011.0927 1045.6419 1051.6407 1079.5535 1091.3864 1111.8110 1171.8906 1179.6946 1185.1380 1200.6592 1220.1975 1229.7939 1266.0224 1273.4922 1288.7350 1298.3375 1308.2368 1336.9094 1346.1724 1351.7672 1358.1588 1377.8876 1399.3606 1405.7169 1424.3057 1474.3339 1493.3200 1513.9115 1548.7353 1588.9936 1618.9044 2983.3243 3001.2148 3034.1068 3055.6994 3059.0376 3079.8186 3123.8840 3226.6759 3249.4875 3324.2870 3542.6088 3575.8898 3606.2158
redmass: 5.7470 5.6353 6.4573 5.9611 6.2979 6.4405 3.8235 5.5454 5.4641 5.2610 4.4248 1.8865 3.1191 2.9183 3.6252 1.4618 3.1997 5.3205 5.9373 5.1444 9.5560 3.6352 4.6465 1.4670 3.7477 7.0829 4.2501 6.4444 7.4923 1.2150 2.9642 2.1454 2.4944 4.9540 4.7903 3.3201 4.7497 6.4504 1.3644 1.4648 3.4551 5.6972 7.5808 3.3036 2.5906 3.8291 3.3088 2.5483 2.1507 2.4944 2.0284 2.0132 1.2134 1.2489 1.9773 1.5437 1.7223 1.2725 1.2500 1.1808 1.6862 1.6476 1.3953 1.3689 1.4924 2.3817 1.4039 1.3589 2.8049 1.7899 1.4155 1.0840 4.3240 5.8766 4.6219 6.7786 11.8102 1.0859 1.0568 1.0864 1.0869 1.0941 1.1034 1.0925 1.0914 1.1070 1.0661 1.0792 1.0665 1.0671
irintensity: 0.2041 8.1579 7.5049 1.7902 4.7811 0.6073 3.2342 6.1038 17.2700 23.2232 0.4768 104.2031 11.9271 38.5594 22.1740 128.6286 15.3501 5.8821 13.5971 11.2877 3.5944 8.3965 3.3878 94.6436 18.3859 6.3180 0.4552 1.9871 25.4710 143.9809 52.9775 27.8694 94.9217 11.1361 29.7632 50.8516 29.1571 12.0444 17.1752 1.9414 90.5992 31.8011 48.1225 64.0445 14.3914 52.2163 119.7225 14.1276 12.2032 8.7452 8.5852 42.3581 45.5611 21.3929 10.4862 33.4263 74.6498 30.2381 4.8172 29.1474 8.3821 25.5707 11.8632 0.8730 18.4400 28.5791 9.7243 31.8799 43.4948 24.1740 36.2675 6.6897 49.7021 117.1051 166.5750 30.5227 478.6596 53.9759 19.6532 17.3272 10.5221 12.4334 44.5823 21.2808 19.0043 5.2307 203.6807 49.1026 15.1555 16.7637
temp: 298.150 k
press: 1.00000 atm
elementType: 8 8 8 8 8 7 7 7 6 6 6 6 6 6 6 6 6 6 6 1 1 1 1 1 1 1 1 1 1 1 1 1
symmnumber: 1
zpe: 636707.4 jmol-1
zpe.correction: 0.242509 hartree
zpe.thermalcorrener: 0.258415 hartree
zpe.thermalcorrenthalpy: 0.259359 hartree
zpe.thermalcorrgfe: 0.199426 hartree
zpe.sumelectzpe: -965.885442 hartree
zpe.sumelectthermal: -965.869536 hartree
zpe.sumelectthermalent: -965.868592 hartree
zpe.sumelectthermalfe: -965.928525 hartree
dipole: 10.2322 1.7664 2.4309
dipole: 10.6643
quadrupole: -146.5873 -100.8717 -103.7522
quadrupole: -16.9216 -4.1147 -5.7713
quadrupole: -29.5169 16.1987 13.3182 -16.9216 -4.1147 -5.7713
hfenergy: -966.1279506 hartree
pointgroup: C01 [X(C11H13N3O5)]
dipole: -3.9478734 -1.3806657 0.3342151 debye
polarizability: 188.4604934|22.1506065|146.4643434|22.6363387|-13.5449355|121.8530289 unknown
InChI: InChI=1S/C11H13N3O5/c15-3-6-7(16)8(17)11(19-6)14-2-1-5-9(14)12-4-13-10(5)18/h1-2,4,6-8,11-12,15-17H,3H2
charge 0 multiplicity 1
32 atoms
O  -1.587219 -1.231713 0.945149
O  -2.357178 -2.778126 -1.546378
O  -3.159884 0.785359 -1.430554
O  -3.957078 1.647968 0.959605
O  4.056391 2.198125 0.123577
N  0.091311 -0.263933 -0.533827
N  1.772264 -1.126988 1.098278
N  3.784865 0.193126 1.347907
C  -0.895905 -1.332849 -0.356521
C  -2.017322 -1.359619 -1.412466
C  -3.173796 -0.525921 -0.789488
C  -2.865161 -0.492651 0.748782
C  -2.704659 0.930725 1.313472
C  1.294391 -0.221659 0.161759
C  0.02941 0.910324 -1.340191
C  2.020093 0.928195 -0.202229
C  1.200744 1.637927 -1.157149
C  3.337856 1.194238 0.389034
C  3.032979 -0.843434 1.64871
H  -0.377101 -2.306728 -0.337887
H  -1.720664 -0.920064 -2.382342
H  -4.146336 -1.027956 -0.965605
H  -3.627548 -1.044744 1.322668
H  -1.830849 1.432073 0.856641
H  -2.579488 0.882904 2.410184
H  -0.85806 1.120764 -1.932586
H  -3.076904 -2.879788 -2.218648
H  -3.67045 1.409712 -0.832168
H  1.462101 2.576103 -1.641066
H  1.204249 -1.896056 1.458849
H  -4.018746 2.502518 1.451283
H  3.382991 -1.572935 2.389705
