program: Gaussian 09
title: 000264345
version: EM64L-G09RevD.01
frameworkgroup: C1[X(C9H6ClNO4)]
method: RPBEPBE
basis: SDD
operation: Freq
keyword: #p
keyword: freq=noraman
keyword: PBEPBE/SDD
title: #p freq=noraman PBEPBE/SDD
converged: YES YES NO NO
title: Mulliken charges:
elementType: Cl O O O O N C C C C C C C C C H H H H H H
charge: -0.003340 -0.148977 -0.238261 -0.398744 -0.240814 -0.041323 0.181207 -0.032302 0.423716 0.104501 -0.391804 -0.319382 -0.197637 0.129280 -0.506895 0.291423 0.261178 0.240450 0.247414 0.246615 0.393694
chargesum: 0.00000
title: Mulliken charges with hydrogens summed into heavy atoms:
elementType: Cl O O O O N C C C C C C C C C
charge: -0.003340 -0.148977 -0.238261 -0.005050 -0.240814 -0.041323 0.181207 -0.032302 0.423716 0.104501 -0.100381 -0.319382 0.063540 0.129280 0.227584
polarizability: 2.20597736e+02 -4.74586187e+00 1.49905009e+02 7.18843701e-03 -1.91721622e-02 5.36410627e+01
1716.lowfreq: -7.7845 0.0013 0.0013 0.0021 1.1833 5.7665 47.2879 60.4008 81.2882
frequency: 47.2867 60.4006 81.2869 100.9298 112.8277 169.4295 183.5106 215.7163 230.9395 271.2599 282.5907 333.6531 337.5285 395.5259 445.2655 511.9350 514.2545 554.2770 554.7741 592.6392 622.8014 635.9737 657.0129 709.3553 729.4923 755.4704 818.4994 839.6145 901.5901 915.2836 960.1480 966.1582 1046.6953 1107.1527 1108.6265 1118.6987 1145.7336 1170.9831 1218.1099 1270.8584 1304.2395 1366.5032 1412.0054 1434.3896 1446.9366 1454.1994 1459.6945 1510.3892 1541.1776 1612.8521 1622.8888 3003.7132 3110.7975 3144.6474 3167.0131 3196.6715 3525.6427
redmass: 3.7099 7.7738 7.1249 4.7810 8.8561 1.3206 5.2483 5.1583 6.4580 5.6935 11.3530 7.3525 6.1498 8.8104 8.4541 7.6029 3.0395 6.2914 2.6319 3.2175 3.1828 5.3451 6.9581 10.0520 8.3164 4.9709 1.5923 10.7077 10.6063 8.1218 1.3007 9.3007 3.2055 1.2486 4.1289 1.9923 1.7305 1.7267 2.6129 4.3769 3.1273 2.7254 2.9821 3.3979 1.7745 1.1677 1.0481 6.5968 6.5062 8.9494 9.3878 1.0293 1.1052 1.1049 1.0896 1.0975 1.0644
irintensity: 5.4314 3.3027 3.5037 0.0718 0.9220 0.7297 2.4803 0.4532 5.2308 0.2756 1.0330 1.4154 2.4285 9.1205 3.6423 24.4445 21.6302 2.8161 41.4732 17.0686 107.3545 36.5076 2.1339 4.5871 50.4927 0.2489 49.6361 30.1437 102.2679 16.0919 0.3504 128.9405 349.3491 0.0142 9.2065 4.0043 96.2656 62.2547 41.0162 99.1869 177.6920 12.5331 67.4899 71.6928 12.8179 36.2970 17.2907 206.0054 67.9607 248.9028 47.2843 26.9137 21.9383 25.1825 2.1618 1.3166 87.3439
temp: 298.150 k
press: 1.00000 atm
elementType: 17 8 8 8 8 7 6 6 6 6 6 6 6 6 6 1 1 1 1 1 1
symmnumber: 1
zpe: 358927.8 jmol-1
zpe.correction: 0.136708 hartree
zpe.thermalcorrener: 0.150149 hartree
zpe.thermalcorrenthalpy: 0.151093 hartree
zpe.thermalcorrgfe: 0.095580 hartree
zpe.sumelectzpe: -1161.124420 hartree
zpe.sumelectthermal: -1161.110980 hartree
zpe.sumelectthermalent: -1161.110035 hartree
zpe.sumelectthermalfe: -1161.165548 hartree
dipole: 0.6500 0.4475 0.0124
dipole: 0.7892
quadrupole: -88.5246 -89.4657 -92.5809
quadrupole: -5.2726 -0.0167 0.0304
quadrupole: 1.6658 0.7247 -2.3905 -5.2726 -0.0167 0.0304
hfenergy: -1161.2611286 hartree
pointgroup: C01 [X(C9H6Cl1N1O4)]
dipole: -0.2320242 -0.2052608 0.0208791 debye
dipolederiv: -0.6669927 -0.3146696 0.0158543 -0.2478141 -0.1715331 0.0082786 0.0081909 0.0061617 -0.0306513 -0.1909681 -0.3603957 0.0367886 -0.6061599 -0.2155085 -0.0037954 0.0642581 0.0039625 -0.0814273 -0.8567132 0.8290487 -0.1125851 0.6779854 -1.1495818 0.1219954 -0.0921353 0.1227743 -0.2800278 -1.2052644 -0.5335158 0.0353236 -0.7866702 -0.6531741 0.0031 0.0640485 0.0110224 -0.4108645 -0.9423053 0.1650763 -0.0373363 0.4230092 -0.8312036 0.0695898 -0.0657091 0.0613402 -0.335431 -0.1543505 0.2033999 -0.0234254 0.1516498 -0.1036153 0.0010455 -0.0166288 0.002139 -0.1343327 -0.0877928 -0.0373596 -0.0011807 0.67586 0.0765079 0.0219096 -0.0811776 -0.0002014 0.0831171 0.1870957 0.4351062 -0.0431407 -0.1572268 -0.0662992 0.0031415 0.0235986 0.0206471 0.0036091 0.6357848 -1.0480751 0.1337002 -0.7964892 0.7029402 -0.0853606 0.1033161 -0.0910582 0.1720303 -0.9401101 0.118908 -0.0438706 0.5269354 0.1469299 0.0058714 -0.0890942 -0.0066633 0.0513335 -0.3930052 0.047077 -0.0119228 -0.3485002 -0.0078226 -0.0301971 0.032505 -0.0180351 -0.179009 0.9506295 0.4959785 -0.0226402 0.8338562 -0.2018774 0.0326663 -0.060865 0.0226243 -0.1459209 0.2622379 -0.2298234 0.035878 -0.2934231 0.1921603 -0.0374277 0.0426798 -0.0355062 -0.0558198 2.6290634 0.1993701 0.0496496 -0.0558087 1.2204402 -0.107666 0.0772702 -0.0997149 0.2889579 0.2565878 -0.0533499 0.0051939 -0.2969549 0.7916237 -0.0692729 0.0324319 -0.0609452 0.2860473 0.0483416 0.0555209 -0.0103562 -0.0100602 0.0740276 0.011986 -0.0030288 0.0140382 0.1824383 0.096562 -0.0449803 0.0031874 -0.0251789 -0.0129767 0.0182841 0.0011768 0.0176618 0.1550317 -0.1114017 0.122966 -0.0201696 0.0525062 0.0293397 0.0130733 -0.012362 0.0149961 0.1268244 0.0758229 -0.0875887 -0.083084 0.0384137 -0.0303371 -0.0074149 -0.0934806 -0.0342559 -0.0488047 0.0653059 -0.0666634 0.1076027 0.0602344 -0.0234261 0.0054053 0.0874677 0.0266434 -0.0493634 0.3414723 0.10397 -0.0134667 0.183836 0.2333857 0.0247877 -0.0224621 0.0223691 0.4022629 unknown
polarizability: 220.5253145|4.6158473|148.6505532|4.6204265|-10.5380078|54.9679402 unknown
InChI: InChI=1S/C9H6ClNO4/c1-14-8-5(10)3-2-4-6(8)11-15-7(4)9(12)13/h2-3,12H,1H3
charge 0 multiplicity 1
21 atoms
Cl 3.815436 1.878381 0.047061
O  -1.432342 -1.63297 0.278825
O  2.984573 -0.935194 0.336588
O  -4.053492 -0.893182 0.117042
O  -3.484725 1.360949 -0.117913
N  0.001532 -1.795585 0.341084
C  -0.565969 0.470933 0.070541
C  0.498357 -0.516588 0.2136
C  1.887267 -0.108697 0.210747
C  -1.751929 -0.280595 0.118053
C  -0.282855 1.859139 -0.07591
C  2.110127 1.270646 0.063078
C  1.060651 2.234851 -0.076947
C  -3.143695 0.1581 0.026751
C  2.810512 -2.395278 0.502124
H  -1.093129 2.582682 -0.181561
H  1.343857 3.28585 -0.186116
H  3.837698 -2.780505 0.571716
H  2.287264 -2.828674 -0.366209
H  2.244791 -2.620156 1.421487
H  -4.977427 -0.529405 0.04876
