program: Gaussian 09
title: 000264342
version: EM64L-G09RevD.01
frameworkgroup: C1[X(C7H8N4O2)]
method: RPBEPBE
basis: SDD
operation: Freq
keyword: #pfreq=noraman
keyword: PBEPBE/SDD
title: #p freq=noraman PBEPBE/SDD
converged: NO YES NO NO
title: Mulliken charges:
elementType: O O N N N N C C C C C C C H H H H H H H H
charge: -0.388045 -0.225708 -0.196099 -0.329831 -0.042245 -0.000767 -0.280547 0.275996 0.170252 0.133256 -0.645924 -0.350157 -0.376187 0.278237 0.342065 0.286751 0.239864 0.247909 0.261609 0.347588 0.251982
chargesum: 0.00000
title: Mulliken charges with hydrogens summed into heavy atoms:
elementType: O O N N N N C C C C C C C
charge: -0.040457 -0.225708 -0.196099 0.012234 -0.042245 -0.000767 -0.002310 0.275996 0.170252 0.133256 0.128601 -0.088548 -0.124206
polarizability: 1.58806870e+02 -2.18273894e+00 1.10372911e+02 -5.75271951e+00 7.00801072e+00 6.16236718e+01
1716.lowfreq: -0.0008 -0.0001 0.0005 4.6507 5.3641 12.8234 66.8595 82.7924 127.5591
frequency: 66.8419 82.7766 127.5512 189.4266 201.3777 260.8283 286.8714 303.7262 329.0447 368.9904 403.6175 433.8392 460.8073 475.2728 542.5772 576.0175 593.3317 656.6650 682.8078 722.2766 753.4956 776.9190 858.9145 864.2191 887.3959 902.9825 933.3307 1005.7637 1064.0563 1119.8649 1123.6230 1155.7056 1189.0237 1222.0575 1271.1452 1283.4378 1309.8712 1320.1408 1350.2462 1381.4721 1398.2456 1413.3553 1425.5110 1479.2177 1489.9345 1499.7238 1546.4778 1551.4109 1617.7302 2992.5217 3080.9058 3116.5976 3126.1358 3151.8592 3173.0885 3530.8140 3534.2662
redmass: 6.1504 6.2859 3.4399 1.5480 2.2456 3.8810 2.6779 1.6154 3.4636 5.0723 4.4543 6.7888 5.7375 4.0720 7.1931 4.8823 3.6440 1.6316 5.8194 7.7548 5.3086 5.7939 4.0798 4.7449 1.4940 5.6056 1.4651 4.6885 2.7410 3.1282 1.3515 2.2625 2.0176 1.7049 4.6823 3.2745 1.7829 2.9498 1.8532 1.1362 1.5692 2.4689 1.2716 1.1032 1.0548 2.9750 6.7413 5.2142 9.1316 1.0344 1.1027 1.0882 1.0996 1.0915 1.0932 1.0771 1.0665
irintensity: 0.2929 5.0997 0.1084 0.0547 0.4899 6.9326 16.0749 64.8190 29.1509 11.6598 6.2119 5.0364 2.1291 2.8183 4.7626 5.4262 32.4384 95.1039 25.3559 9.3616 7.8487 15.3983 8.6336 69.6279 19.8530 147.2612 1.1965 14.8638 11.0620 3.0264 0.9319 46.0130 23.7565 94.1036 85.3979 39.6419 38.9307 6.0820 25.6401 45.3582 15.1739 58.9864 58.9659 27.1760 26.7199 151.7185 61.0130 89.0402 450.5421 28.8842 19.7912 6.4497 1.0244 16.9123 10.9568 51.4986 13.6237
temp: 298.150 k
press: 1.00000 atm
elementType: 8 8 7 7 7 7 6 6 6 6 6 6 6 1 1 1 1 1 1 1 1
symmnumber: 1
zpe: 410714.5 jmol-1
zpe.correction: 0.156433 hartree
zpe.thermalcorrener: 0.167405 hartree
zpe.thermalcorrenthalpy: 0.168350 hartree
zpe.thermalcorrgfe: 0.119749 hartree
zpe.sumelectzpe: -640.051620 hartree
zpe.sumelectthermal: -640.040647 hartree
zpe.sumelectthermalent: -640.039703 hartree
zpe.sumelectthermalfe: -640.088304 hartree
dipole: -0.6037 1.0321 0.2560
dipole: 1.2228
quadrupole: -98.5789 -69.1185 -73.9097
quadrupole: 2.0402 0.2811 3.8514
quadrupole: -18.0432 11.4172 6.6260 2.0402 0.2811 3.8514
hfenergy: -640.2080525 hartree
pointgroup: C01 [X(C7H8N4O2)]
dipole: -0.2701348 0.3795434 0.1200765 debye
dipolederiv: -0.5297537 -0.0641535 -0.1572384 -0.0080501 -0.5062265 0.1656913 -0.5537542 0.2791706 -0.682634 -1.2878449 -0.1369008 0.2193573 -0.4024216 -0.5424617 0.1208109 0.2639411 0.0471251 -0.3834765 -1.3225855 -0.2411617 0.1930212 0.2282585 -0.5472664 -0.0318372 0.2226429 0.018221 -0.2126886 -1.1670774 0.4582572 -0.0512808 0.1843995 -0.3693875 -0.0221939 0.1781863 -0.1262433 -0.6150701 -0.6236617 0.2915557 0.0774882 -0.0581876 -0.3866287 -0.0370327 0.0278774 -0.0592144 -0.2208827 -0.6483438 0.0395488 0.0590368 -0.3069374 -0.5115181 -0.0254717 -0.016223 -0.0986618 -0.2268658 0.9876431 -0.1508158 0.2705404 0.0577454 0.2079883 -0.0685929 0.4784621 -0.136688 0.8625547 0.5801045 0.4491165 -0.0430019 0.7864249 -0.2164169 -0.179123 0.0516889 -0.1766338 0.0905531 1.8153362 0.0358928 -0.4209402 -0.0982079 0.5446772 -0.0475503 -0.5005365 -0.0655424 0.1766407 0.8992912 -0.4990527 -0.1568617 -0.8181145 0.4651247 0.1277751 -0.3127396 0.1453905 0.1832689 -0.0153963 0.0064332 0.0396704 -0.0193487 0.3988503 0.0213762 0.0869084 0.022403 0.2119013 0.3706015 -0.1906353 -0.0954503 0.1659437 0.3260515 0.0667501 -0.0328416 0.1340538 -0.066079 0.4246192 -0.0759123 -0.0721611 0.2428583 0.4841404 0.1044776 -0.0075499 0.1550213 -0.0096848 -0.0068941 0.0349698 0.0435553 0.0375396 0.056355 -0.0292546 -0.0040469 -0.0106139 0.0085687 0.1328883 -0.0436311 -0.0062563 -0.027313 0.2048241 -0.0181335 0.0017998 0.0364368 0.3532197 0.0223151 -0.1246787 0.0176904 0.0125841 0.14508 -0.0052288 0.0288443 0.02951 0.1281814 0.1035253 0.0731903 0.0702174 0.0176407 0.012389 -0.0111212 0.0354927 -0.0780881 -0.0882944 0.0195989 0.1149739 -0.1066451 0.0194559 0.0116301 0.0112552 -0.0838924 0.0385763 0.0039264 0.1185924 -0.0349641 -0.0076034 -0.0485594 -0.0669102 -0.038782 -0.0161967 -0.0391727 0.1265353 0.1666896 0.1268703 0.120352 0.11137 0.2353 -0.0935515 0.1419084 -0.1045978 0.2283501 -0.0396478 -0.0689025 0.00651 -0.0770805 0.0544055 -0.0102629 0.0100283 -0.0104522 0.1319755 unknown
polarizability: 157.569046|3.1576589|110.350416|-12.4381868|6.4902083|62.8839908 unknown
InChI: InChI=1S/C7H8N4O2/c1-11-4-2-8-3-9-5(4)10-6(12)7(11)13/h2-3,6,10,12H,1H3
charge 0 multiplicity 1
21 atoms
O  2.246157 -1.538169 1.03705
O  2.943135 1.014293 -0.701017
N  0.681439 1.148959 -0.097596
N  0.458497 -1.594485 -0.634745
N  -1.87623 -1.550765 -0.258359
N  -2.97918 0.500895 0.450131
C  1.781021 -1.096767 -0.295287
C  -0.571599 0.499863 0.037307
C  1.858623 0.439174 -0.411929
C  -0.681715 -0.896371 -0.277695
C  0.750925 2.624241 -0.016791
C  -1.769188 1.147431 0.410008
C  -2.969952 -0.814111 0.094641
H  2.53809 -1.527902 -0.965965
H  0.338369 -2.588561 -0.84792
H  1.784432 2.919665 -0.251084
H  0.48998 2.97134 0.99881
H  0.063316 3.083381 -0.748501
H  -1.786704 2.209351 0.674021
H  1.699202 -1.112749 1.748756
H  -3.929319 -1.338712 0.107264
