program: Gaussian 09
title: 000264373
version: EM64L-G09RevD.01
frameworkgroup: C1[X(C14H10ClF3)]
method: RPBEPBE
basis: SDD
operation: Freq
keyword: #p
keyword: freq=noraman
keyword: PBEPBE/SDD
title: #p freq=noraman PBEPBE/SDD
converged: YES YES NO NO
title: Mulliken charges:
elementType: Cl F F F C C C C C C C C C C C C C C H H H H H H H H H H
charge: -0.066727 -0.166967 -0.165549 -0.165768 -0.676722 0.512433 0.582402 -0.469451 0.290552 -0.440954 -0.358622 -0.356703 -0.361802 -0.202541 0.247341 -0.230353 -0.235498 -0.233850 0.252144 0.242434 0.275220 0.244176 0.265615 0.250769 0.238236 0.258164 0.234500 0.237523
chargesum: 0.00000
title: Mulliken charges with hydrogens summed into heavy atoms:
elementType: Cl F F F C C C C C C C C C C C C C C
charge: -0.066727 -0.166967 -0.165549 -0.165768 -0.182144 0.512433 0.582402 -0.194232 0.290552 -0.196777 -0.093007 -0.356703 -0.111033 0.035695 0.247341 0.027810 -0.000998 0.003673
polarizability: 1.87396064e+02 1.92199266e+01 1.44967635e+02 -2.03910110e+01 5.32003641e+00 1.31724436e+02
1716.lowfreq: -14.2944 -11.1706 -6.1054 -0.0016 0.0012 0.0020 1.3905 10.0654 16.0071
frequency: -13.5478 9.1829 15.5736 52.8397 119.4206 123.4124 164.6196 173.9554 216.6324 232.7092 290.7102 301.3406 326.1557 363.0792 367.7432 400.4935 426.6950 437.3843 463.8751 499.5018 518.9282 561.5922 574.6116 609.5123 634.8215 672.5157 694.5253 702.3565 724.0176 758.5817 791.2342 819.7129 862.2209 867.1188 911.6967 932.9311 943.6475 962.1962 986.1968 988.8235 989.8132 993.3193 1013.4741 1014.6237 1039.2160 1052.9365 1103.8897 1122.6918 1171.0667 1182.8151 1189.0586 1199.8963 1210.7516 1263.2317 1291.7541 1308.0762 1327.9352 1375.7303 1388.2372 1424.8534 1437.6450 1457.9515 1466.7049 1480.3779 1574.4225 1599.5995 1605.9715 1619.9270 2985.0264 3035.2920 3129.3241 3132.2941 3145.0883 3150.7680 3153.5656 3160.8055 3174.2995 3175.9323
redmass: 16.2533 6.5224 6.7888 5.5553 5.5965 6.5532 7.8131 6.2253 3.7614 5.2351 3.5995 6.5161 7.6717 6.2555 6.5216 6.2855 4.6074 3.1090 5.4559 4.0639 8.4500 5.8800 5.5952 11.6048 6.0745 5.6012 6.1963 2.3064 3.7125 1.2347 2.5067 2.0444 1.3446 4.2152 1.5993 1.4390 1.5411 1.6409 7.8987 1.3579 5.3515 1.4417 6.9254 6.1045 2.1341 3.4211 1.8827 1.6884 1.0905 1.6778 1.1261 1.2294 1.9312 1.6853 2.1022 1.6849 1.6880 5.2405 7.6277 2.1537 2.6621 1.6641 1.5207 2.5872 6.0770 6.2393 6.9920 6.2295 1.0616 1.0975 1.0889 1.0863 1.0900 1.0922 1.0915 1.0951 1.0984 1.0997
irintensity: 0.0289 0.1550 0.6401 0.6789 0.3065 0.1960 2.0874 0.6588 1.7407 1.5449 4.6087 1.8153 4.4427 2.1405 2.9912 2.1947 1.3973 8.4436 8.1361 0.3718 0.5108 5.6299 7.2016 13.5745 5.3833 15.1410 5.5428 20.9688 3.8737 79.1807 46.5666 23.4446 1.7579 34.3126 7.6266 30.4243 5.3419 12.1626 190.2725 1.1447 6.1282 2.4507 52.6702 162.3236 11.0418 104.8077 5.0821 4.1972 1.7217 34.6700 6.6422 8.7672 40.8076 32.1722 127.1242 55.6693 21.6320 1.7758 2.0113 19.7970 22.9791 47.9742 4.2711 9.9840 10.9891 10.9353 0.9668 6.5616 11.6091 7.8428 7.8521 1.7108 9.1927 3.1465 8.2311 13.3313 8.7537 11.9323
temp: 298.150 k
press: 1.00000 atm
elementType: 17 9 9 9 6 6 6 6 6 6 6 6 6 6 6 6 6 6 1 1 1 1 1 1 1 1 1 1
symmnumber: 1
zpe: 524269.0 jmol-1
zpe.correction: 0.199684 hartree
zpe.thermalcorrener: 0.214504 hartree
zpe.thermalcorrenthalpy: 0.215448 hartree
zpe.thermalcorrgfe: 0.154374 hartree
zpe.sumelectzpe: -1297.818153 hartree
zpe.sumelectthermal: -1297.803332 hartree
zpe.sumelectthermalent: -1297.802388 hartree
zpe.sumelectthermalfe: -1297.863462 hartree
dipole: -1.8568 2.1936 -2.9866
dipole: 4.1448
quadrupole: -115.0056 -104.3437 -109.8458
quadrupole: 14.5255 -2.0943 -0.4566
quadrupole: -5.2739 5.3880 -0.1141 14.5255 -2.0943 -0.4566
hfenergy: -1298.0178364 hartree
pointgroup: C01 [X(C14H10Cl1F3)]
dipole: -0.9878298 1.2958551 0.0638217 debye
polarizability: 173.4401562|36.1499363|144.0442395|-8.8801362|-2.9149581|146.6037391 unknown
InChI: InChI=1S/C14H10ClF3/c15-13-7-2-1-5-11(13)8-10-4-3-6-12(9-10)14(16,17)18/h1-7,9H,8H2
charge 0 multiplicity 1
28 atoms
Cl -3.065985 -1.605287 2.717962
F  3.79766 0.03145 -2.131608
F  3.873204 -1.23971 -0.259664
F  2.195935 -1.534278 -1.751385
C  -1.164051 0.63761 1.550753
C  0.151356 1.049774 0.902315
C  -2.204017 0.049319 0.598678
C  0.919847 0.109863 0.172167
C  2.155935 0.486507 -0.396136
C  0.652157 2.367594 1.044622
C  2.652428 1.804055 -0.249051
C  -3.126715 -0.944984 1.004741
C  -2.328059 0.51881 -0.736853
C  1.890364 2.743025 0.474266
C  2.980523 -0.537072 -1.122919
C  -4.118851 -1.467691 0.152601
C  -3.313731 0.01738 -1.612582
C  -4.211846 -0.980041 -1.169603
H  -0.964785 -0.100221 2.35064
H  -1.607788 1.515679 2.060487
H  0.546363 -0.911079 0.038136
H  0.067458 3.106932 1.605009
H  3.607889 2.086616 -0.701085
H  -1.628734 1.286247 -1.086895
H  2.259106 3.767036 0.592113
H  -4.802766 -2.239465 0.517083
H  -3.379258 0.401062 -2.636072
H  -4.978138 -1.38033 -1.841519
