program: Gaussian 09
title: 000264362
version: EM64L-G09RevD.01
frameworkgroup: C1[X(C11H19ClN2O3)]
method: RPBEPBE
basis: SDD
operation: Freq
keyword: #p
keyword: freq=noraman
keyword: PBEPBE/SDD
title: #p freq=noraman PBEPBE/SDD
converged: YES YES NO NO
title: Mulliken charges:
elementType: Cl O O O N N C C C C C C C C C C C H H H H H H H H H H H H H H H H H H H
charge: -0.087225 -0.257648 -0.262708 -0.324517 -0.504643 -0.408109 0.374454 -0.495695 -0.472090 -0.409824 -0.444398 0.133386 0.277009 -0.255640 -0.328783 -0.663303 -0.551459 0.220758 0.259710 0.242142 0.224310 0.215046 0.220651 0.208120 0.252376 0.327273 0.299245 0.236958 0.226502 0.239446 0.266407 0.250625 0.229064 0.221395 0.263706 0.277456
chargesum: 0.00000
title: Mulliken charges with hydrogens summed into heavy atoms:
elementType: Cl O O O N N C C C C C C C C C C C
charge: -0.087225 -0.257648 -0.262708 -0.324517 -0.177370 -0.108864 0.374454 -0.015227 -0.005638 0.025873 0.016098 0.133386 0.277009 0.207820 0.177070 0.037782 -0.010296
polarizability: 1.85087279e+02 -3.86582090e+00 1.55524168e+02 -3.56790165e+00 -1.00615232e-02 1.10756797e+02
1716.lowfreq: -12.0251 -0.0024 -0.0019 -0.0013 6.3321 10.7875 19.3434 37.2762 41.7698
frequency: 16.2477 37.2394 41.5831 57.3469 73.5781 77.8482 86.8678 89.7017 106.8669 131.5673 182.3251 201.5595 225.9392 251.7813 256.2551 288.3351 299.0644 320.6808 369.0389 385.3950 408.0744 425.5392 442.7878 479.4449 535.1034 588.2709 618.4740 633.9184 639.7720 708.1611 714.3263 717.5494 736.5650 797.6187 818.4928 826.6140 845.4060 851.4509 871.8903 908.3798 947.0253 961.4756 975.0964 1000.3262 1014.5951 1042.1436 1055.3490 1059.7027 1062.8663 1095.7299 1097.5464 1135.8625 1152.8513 1157.3073 1165.7683 1199.4514 1218.3177 1232.7583 1237.1029 1241.2091 1271.1112 1278.1823 1296.0077 1302.7860 1309.6452 1321.7063 1328.2080 1357.1599 1370.3970 1392.7312 1437.9711 1443.4749 1448.7718 1454.4217 1456.3282 1464.6251 1465.4875 1469.0772 1478.3842 1484.6926 1507.4794 1598.9167 1620.5002 2986.5391 2994.5381 3002.4963 3013.1411 3019.0304 3023.8330 3033.4301 3044.5039 3061.3366 3062.6046 3078.3499 3089.8968 3090.2863 3095.8291 3099.4288 3122.1010 3152.0665 3467.0845 3551.5865
redmass: 6.2926 5.0667 4.0386 4.3109 4.7834 4.8053 3.7226 3.3239 3.8489 4.4033 2.6996 2.7842 1.9458 1.9579 4.5904 2.3058 2.7120 2.6973 3.1393 3.5907 3.8198 1.6852 3.3414 2.0465 1.8210 4.1549 1.3994 2.6548 3.0612 5.7055 3.8808 6.8201 3.0000 1.7836 1.7846 2.1877 1.9865 2.2909 1.9573 2.4810 2.0831 2.0708 2.1390 2.0406 2.4032 2.1787 1.9153 3.3047 1.7553 2.1542 2.3783 2.4890 1.6661 1.7400 1.6298 2.0034 1.6972 1.3662 1.3961 1.6227 1.7237 1.1208 1.2290 1.3706 1.3391 1.3071 1.3564 1.3134 1.3359 1.2325 1.1102 1.1558 1.0868 1.0829 1.1053 1.1696 1.0464 1.3434 1.1404 1.0520 2.5203 8.0855 4.6703 1.0595 1.0360 1.0584 1.0597 1.0605 1.0648 1.0595 1.0983 1.1030 1.0604 1.1029 1.0978 1.1040 1.1031 1.1048 1.1067 1.1119 1.0771 1.0773
irintensity: 0.0195 0.5842 0.9325 1.6893 2.4836 1.3061 1.6633 2.9172 10.5844 9.3224 1.0177 0.2441 13.2039 3.5949 1.1539 2.4625 2.2440 21.6627 23.8262 5.5027 11.4673 7.7400 10.8450 17.1326 3.9799 26.5371 145.6043 47.7248 3.2233 17.0176 17.2248 0.3639 6.9410 6.2839 8.5717 11.5914 22.3742 7.1442 4.1287 5.7426 30.1332 15.1241 9.1045 17.0029 50.4968 9.7440 2.8056 2.5427 3.2025 31.9211 5.2103 269.3735 25.3575 65.4690 2.8630 8.2525 10.2848 12.5835 34.5680 13.2855 196.5273 7.2817 11.6947 69.7757 1.2368 1.3746 36.7118 5.0414 5.1079 25.3005 11.6256 32.8346 24.5051 11.9292 16.3493 18.3477 15.6612 16.2709 10.1954 15.3322 814.5087 247.8824 34.0895 61.1035 15.9916 23.6668 47.8942 51.1279 11.6224 29.3075 7.2476 16.3571 26.7171 13.7987 27.8559 16.6443 1.5959 52.1071 27.2491 17.7214 102.6689 26.1982
temp: 298.150 k
press: 1.00000 atm
elementType: 17 8 8 8 7 7 6 6 6 6 6 6 6 6 6 6 6 1 1 1 1 1 1 1 1 1 1 1 1 1 1 1 1 1 1 1
symmnumber: 1
zpe: 781554.4 jmol-1
zpe.correction: 0.297678 hartree
zpe.thermalcorrener: 0.316456 hartree
zpe.thermalcorrenthalpy: 0.317400 hartree
zpe.thermalcorrgfe: 0.247919 hartree
zpe.sumelectzpe: -1224.492921 hartree
zpe.sumelectthermal: -1224.474144 hartree
zpe.sumelectthermalent: -1224.473199 hartree
zpe.sumelectthermalfe: -1224.542680 hartree
dipole: -2.7666 -0.6281 -0.0030
dipole: 2.8370
quadrupole: -93.8925 -116.0556 -107.4813
quadrupole: 11.4251 -2.8694 1.9541
quadrupole: 11.9173 -10.2458 -1.6715 11.4251 -2.8694 1.9541
hfenergy: -1224.7905993 hartree
pointgroup: C01 [X(C11H19Cl1N2O3)]
dipole: -1.1102735 -0.1082595 0.0370846 debye
polarizability: 183.1020024|-6.6329231|156.1476463|-7.7479644|6.3411971|112.1185956 unknown
InChI: InChI=1S/C11H19ClN2O3/c1-2-17-9(15)11(5-3-4-6-11)14-10(16)13-8-7-12/h13-14H,2-8H2,1H3
charge 0 multiplicity 1
36 atoms
Cl 5.257165 -2.385601 -0.085831
O  -3.135125 -0.298029 0.543987
O  -1.652307 -1.9742 -0.089038
O  1.789464 1.572681 -0.244279
N  0.41667 -0.331859 -0.216801
N  2.687746 -0.529377 -0.753646
C  -0.830682 0.354426 0.168773
C  -0.748333 1.041306 1.589173
C  -1.260144 1.52073 -0.815877
C  -1.567417 2.344873 1.465591
C  -1.247255 2.822305 0.0269
C  -1.886476 -0.766609 0.180326
C  1.628985 0.314936 -0.391337
C  -4.248344 -1.302481 0.58587
C  4.032107 0.000392 -0.96325
C  -4.875973 -1.468238 -0.79986
C  5.04583 -0.498034 0.066444
H  -1.093218 0.372998 2.397511
H  0.313506 1.285476 1.762846
H  -0.561651 1.561989 -1.66687
H  -2.274445 1.324339 -1.20622
H  -1.282928 3.08514 2.234967
H  -2.647303 2.133033 1.570729
H  -1.968766 3.570555 -0.347165
H  -0.233764 3.258578 -0.002392
H  0.319928 -1.340789 -0.377172
H  2.56099 -1.54149 -0.806182
H  -3.842506 -2.257141 0.963287
H  -4.952414 -0.870006 1.314096
H  4.393898 -0.232943 -1.983161
H  3.948096 1.100998 -0.871229
H  -4.154553 -1.908827 -1.507995
H  -5.222256 -0.497846 -1.19535
H  -5.748466 -2.1442 -0.732522
H  6.051511 -0.085987 -0.105631
H  4.71273 -0.329795 1.100513
