program: Gaussian 09
title: 000264435
version: EM64L-G09RevD.01
frameworkgroup: C1[X(C26H22O)]
method: RPBEPBE
basis: SDD
operation: Freq
keyword: #pfreq=noraman
keyword: PBEPBE/SDD
title: #p freq=noraman PBEPBE/SDD
converged: YES YES NO NO
title: Mulliken charges:
elementType: O C C C C C C C C C C C C C C C C C C C C C C C C C C H H H H H H H H H H H H H H H H H H H H H H
charge: -0.208931 -0.729001 0.459537 0.335170 0.168394 0.140350 0.387687 0.227382 -0.085649 -0.486622 0.143288 -0.371462 -0.362544 -0.378058 -0.464147 0.339422 -0.248400 -0.437354 -0.239363 -0.372968 -0.252604 -0.267798 -0.808287 -0.433633 -0.244725 -0.256125 -0.827803 0.240090 0.246839 0.238109 0.251401 0.268438 0.253601 0.238565 0.226080 0.236717 0.265301 0.229158 0.232690 0.231120 0.216771 0.248890 0.257628 0.233987 0.228188 0.232434 0.234002 0.228733 0.235500
chargesum: 0.00000
title: Mulliken charges with hydrogens summed into heavy atoms:
elementType: O C C C C C C C C C C C C C C C C C C C C C C C C C C
charge: -0.208931 -0.242072 0.459537 0.335170 0.168394 0.140350 0.387687 0.227382 -0.085649 -0.248512 0.143288 -0.120061 -0.094106 -0.124457 -0.225582 0.339422 -0.022320 -0.200637 -0.010206 -0.107667 -0.019914 -0.036678 -0.084998 -0.199645 -0.016537 -0.023690 -0.129567
polarizability: 3.00351070e+02 -1.48255085e+01 2.56762319e+02 -3.77600841e+00 5.53884744e+00 2.92177596e+02
1716.lowfreq: -5.0591 -0.0004 0.0004 0.0006 3.0438 7.8150 13.6728 17.8018 27.2370
frequency: 13.6005 17.4267 27.0996 42.0576 49.7762 62.1681 72.9783 107.0117 111.7211 138.1964 152.3489 162.3158 177.8917 197.2317 216.3983 249.0577 251.6493 265.0675 290.4019 306.5954 351.5477 362.7120 410.3908 418.9644 424.9756 450.3831 468.9747 472.6403 478.5710 502.5035 507.3380 510.6855 514.0534 527.8626 567.3700 578.5348 611.8065 624.0077 646.2143 666.2266 695.8473 708.3357 740.4997 746.1365 752.2691 765.9473 784.1260 788.7531 792.8724 802.7500 813.6664 818.4458 829.0251 865.9522 881.1174 888.7585 916.6917 923.5449 930.4946 942.5013 960.7959 970.2044 983.5857 984.2225 993.3714 994.3107 998.1077 1022.1505 1025.6586 1041.7443 1047.6937 1052.8893 1067.2307 1076.9955 1092.5184 1098.9046 1150.1026 1170.3133 1172.1345 1176.1208 1180.4775 1185.4794 1194.0348 1197.7397 1216.5328 1237.0748 1248.1198 1257.2657 1266.5619 1275.3710 1283.1108 1313.0605 1366.8951 1373.3631 1379.8599 1397.3346 1406.2085 1407.9331 1418.5944 1426.3784 1433.9970 1439.9262 1440.9125 1455.0654 1460.0588 1461.1608 1468.4927 1472.2890 1476.2834 1482.5434 1517.3493 1538.1342 1574.3234 1588.9117 1589.1990 1596.4196 1598.7272 1607.5399 1633.1750 2974.2791 2985.1666 2988.9732 3044.3889 3050.1188 3060.9568 3086.0045 3115.9214 3117.4508 3120.4495 3121.5824 3126.1907 3126.5445 3134.9058 3136.5966 3138.5981 3149.5599 3151.0108 3154.3925 3158.7459 3165.4038 3166.2633
redmass: 4.8012 3.9387 4.0524 3.6140 3.8468 3.9794 1.5860 3.6739 4.2929 4.2915 4.3188 1.0850 4.0814 4.0444 3.9820 4.5593 3.4696 3.7162 2.8896 4.6153 2.5364 5.7521 3.5292 3.3510 3.1328 3.0901 3.5730 3.3023 4.3718 5.6331 5.0417 4.6703 3.5839 3.5941 4.5576 5.2379 3.9333 5.8868 4.6655 4.2455 4.7948 3.1633 1.5032 1.8917 1.7828 4.4196 4.0932 1.6836 2.5908 2.0256 2.7994 2.1717 3.0921 3.1962 1.7305 1.6235 1.6094 1.3999 1.8497 2.5286 1.3849 1.4392 1.3662 1.3502 1.3514 1.4309 1.3432 3.1188 1.4661 2.4650 2.5608 1.6679 2.5848 2.1585 2.0716 2.0167 1.4249 1.4297 1.1862 1.0743 1.1950 1.8766 1.8853 1.5670 2.2437 1.8512 1.6787 1.7604 1.7252 2.0458 2.4930 1.5794 6.6249 4.6917 2.3261 1.2353 3.0673 1.2198 5.1802 2.0933 2.0088 2.1965 1.9556 2.3578 1.2545 1.2258 1.2936 2.2133 1.0991 1.1310 3.8223 8.0470 6.5896 6.7006 7.4824 5.7605 5.3056 6.0941 6.5766 1.0382 1.0414 1.0626 1.0967 1.0962 1.0946 1.0987 1.0872 1.0965 1.0864 1.0870 1.0871 1.0886 1.0889 1.0903 1.0891 1.0944 1.0945 1.0990 1.0993 1.1006 1.0995
irintensity: 0.0349 2.0183 0.1743 0.2594 1.3020 0.4786 0.7279 2.4192 1.6486 0.2911 0.5363 0.7027 2.3411 0.1962 1.6526 0.5507 4.5016 1.7123 1.4972 2.6921 1.0666 4.0128 1.7867 8.3755 1.9538 2.1323 2.7360 0.0384 2.0902 3.3543 2.2703 1.7752 6.3105 5.7333 2.2857 4.2681 3.8394 16.9630 2.4672 9.2013 0.7403 14.7047 10.8148 25.7334 60.9707 2.2430 10.9041 28.9463 44.3431 69.3404 13.5804 4.2226 14.1622 1.0278 2.7079 3.0960 4.9521 8.0573 9.1993 31.1922 2.5431 2.4525 2.7995 0.3610 0.6485 7.0486 0.5811 8.9550 13.2055 2.8203 1.3228 2.5711 2.7261 6.1543 9.5699 13.0005 1.6892 3.0725 3.8397 0.7757 0.8122 1.2695 4.4284 1.0404 1.0644 4.0363 5.5586 44.5928 18.7364 57.5752 130.3397 12.3993 9.8789 4.9582 8.2495 6.7392 4.7334 35.1873 1.5856 3.5536 55.4033 4.9500 2.3738 1.2801 7.2171 19.1301 25.1987 20.0319 17.7506 1.3634 10.6988 118.9654 9.9727 11.0421 1.8892 7.8198 6.5650 21.0668 0.4145 33.2433 17.0163 19.7325 5.9040 24.6078 13.8190 20.6738 7.6631 9.7808 1.7982 8.9404 6.9174 9.5163 8.5218 16.6832 5.2660 13.3353 35.3893 40.6010 20.6551 31.6724 17.8150
temp: 298.150 k
press: 1.00000 atm
elementType: 8 6 6 6 6 6 6 6 6 6 6 6 6 6 6 6 6 6 6 6 6 6 6 6 6 6 6 1 1 1 1 1 1 1 1 1 1 1 1 1 1 1 1 1 1 1 1 1 1
symmnumber: 1
zpe: 1038436.1 jmol-1
zpe.correction: 0.395519 hartree
zpe.thermalcorrener: 0.418700 hartree
zpe.thermalcorrenthalpy: 0.419644 hartree
zpe.thermalcorrgfe: 0.340362 hartree
zpe.sumelectzpe: -1077.356319 hartree
zpe.sumelectthermal: -1077.333138 hartree
zpe.sumelectthermalent: -1077.332194 hartree
zpe.sumelectthermalfe: -1077.411476 hartree
dipole: -0.0448 -1.2169 -2.5888
dipole: 2.8609
quadrupole: -144.4765 -149.5867 -151.8157
quadrupole: -6.4062 -4.8829 -4.1283
quadrupole: 4.1498 -0.9604 -3.1894 -6.4062 -4.8829 -4.1283
hfenergy: -1077.751838 hartree
pointgroup: C01 [X(C26H22O1)]
dipole: 0.0792447 0.6628677 0.9062161 debye
polarizability: 297.3288158|20.0375373|262.9232747|-1.5615469|8.672617|289.0388947 unknown
InChI: InChI=1S/C26H22O/c1-18-9-7-16-23(19(18)2)26(27)25-15-6-4-11-22(25)17-21-13-8-12-20-10-3-5-14-24(20)21/h3-16H,17H2,1-2H3
charge 0 multiplicity 1
49 atoms
O  1.827473 -1.466344 -2.298258
C  -0.177065 0.217525 0.945869
C  -1.608863 0.668542 1.215904
C  0.009293 -1.302736 0.819271
C  -2.629891 0.572964 0.194586
C  0.907539 -1.894993 -0.121561
C  -3.972652 1.037261 0.490589
C  2.633362 0.009931 -0.553102
C  1.777838 -1.10949 -1.077724
C  -1.944541 1.206319 2.465114
C  2.998727 1.136639 -1.360375
C  -0.758444 -2.162302 1.645695
C  0.977906 -3.310472 -0.237068
C  -2.368578 0.04111 -1.113459
C  -4.266141 1.57605 1.787323
C  3.896733 2.107027 -0.815752
C  -3.268925 1.659139 2.758159
C  -4.984913 0.955043 -0.522508
C  -0.649448 -3.565968 1.555988
C  3.151068 -0.127519 0.765459
C  0.218488 -4.147344 0.602406
C  -3.374457 -0.024877 -2.080945
C  2.45003 1.34227 -2.761874
C  4.414287 1.931863 0.491839
C  -4.695734 0.43567 -1.785576
C  4.047727 0.822359 1.28483
C  4.314338 3.3256 -1.621876
H  0.202588 0.714511 0.035324
H  0.464481 0.585255 1.76994
H  -1.169673 1.286729 3.237353
H  -1.468446 -1.716952 2.35139
H  1.641804 -3.735074 -0.997477
H  -1.368973 -0.331286 -1.356845
H  -5.284342 1.92325 2.000197
H  -3.491275 2.073724 3.747464
H  -5.995382 1.310297 -0.286344
H  2.86401 -0.999008 1.363529
H  -1.25212 -4.202828 2.213409
H  0.296068 -5.236093 0.511976
H  -3.152561 -0.435792 -3.071911
H  2.263356 2.412205 -2.961138
H  3.172365 0.983766 -3.520367
H  1.522621 0.778159 -2.936575
H  5.112437 2.677962 0.890502
H  -5.476026 0.377291 -2.552451
H  4.461219 0.701178 2.291763
H  3.460198 4.004857 -1.809091
H  5.089106 3.90297 -1.089603
H  4.719789 3.043113 -2.610997
