program: Gaussian 09
title: 000256208
version: EM64L-G09RevD.01
frameworkgroup: C1[X(C7H7NO2)]
method: RPBEPBE
basis: SDD
operation: Freq
keyword: #pfreq=noraman
keyword: PBEPBE/SDD
title: #p freq=noraman PBEPBE/SDD
converged: YES YES NO NO
title: Mulliken charges:
elementType: O O N C C C C C C C H H H H H H H
charge: -0.430124 -0.248563 0.006490 0.433471 -0.377776 0.257757 -0.795113 -0.469819 -0.409932 0.120432 0.281454 0.240477 0.228064 0.240045 0.251792 0.284303 0.387042
chargesum: 0.00000
title: Mulliken charges with hydrogens summed into heavy atoms:
elementType: O O N C C C C C C C
charge: -0.043082 -0.248563 0.006490 0.433471 -0.096322 0.257757 -0.086527 -0.218027 -0.125629 0.120432
polarizability: 1.22567930e+02 6.30519820e-02 9.50528098e+01 -1.16505216e-02 -3.98778044e-04 4.06858624e+01
1716.lowfreq: -8.8719 -7.0689 -0.0007 0.0005 0.0005 7.3663 50.2772 61.3255 150.2982
frequency: 50.2730 61.3215 150.2973 171.0949 205.4188 317.0251 372.7928 418.4223 454.9038 477.1428 540.4713 598.3957 602.5992 689.9100 705.6592 737.7585 889.8472 900.3013 950.2522 970.9898 990.2301 1014.3123 1054.5989 1055.3852 1128.3442 1145.2706 1236.2720 1312.1236 1319.8915 1330.9183 1402.0143 1418.8229 1437.6682 1469.9658 1476.4874 1550.5697 1597.6987 1641.4238 2984.1092 3065.6846 3090.8184 3121.7150 3144.4985 3167.9621 3528.9433
redmass: 1.1512 4.5773 4.5575 5.1449 2.7380 3.5867 6.0405 3.9081 3.0364 6.0400 5.2226 4.9744 1.2310 7.0082 3.5657 2.9590 5.9995 1.5736 1.3827 1.4452 1.6835 4.0418 2.5632 1.5817 2.5423 1.6648 1.8944 5.3655 1.5660 2.0705 1.2930 2.2592 2.8861 1.0447 1.1565 4.8846 5.9616 8.9149 1.0371 1.0979 1.0991 1.0917 1.0930 1.0932 1.0642
irintensity: 1.3443 2.0289 0.2431 2.9670 0.8376 0.7772 9.2044 0.9143 1.2719 9.7108 3.6147 39.9040 157.2719 9.9599 1.1802 48.0291 23.9639 14.6123 1.0197 3.8053 18.3533 24.4284 210.4887 16.0262 62.1935 41.2006 0.3192 17.6499 23.3080 68.7284 15.8716 5.7677 57.8548 14.6396 16.5170 6.5926 17.7886 267.9014 22.5867 15.5247 14.9839 22.3857 2.4736 1.2768 47.5007
temp: 298.150 k
press: 1.00000 atm
elementType: 8 8 7 6 6 6 6 6 6 6 1 1 1 1 1 1 1
symmnumber: 1
zpe: 334658.9 jmol-1
zpe.correction: 0.127465 hartree
zpe.thermalcorrener: 0.136574 hartree
zpe.thermalcorrenthalpy: 0.137518 hartree
zpe.thermalcorrgfe: 0.092375 hartree
zpe.sumelectzpe: -475.427489 hartree
zpe.sumelectthermal: -475.418379 hartree
zpe.sumelectthermalent: -475.417435 hartree
zpe.sumelectthermalfe: -475.462578 hartree
dipole: -0.9267 -1.2570 0.0054
dipole: 1.5617
quadrupole: -44.4575 -66.7837 -59.1014
quadrupole: 8.3303 -0.0050 -0.0040
quadrupole: 12.3234 -10.0028 -2.3206 8.3303 -0.0050 -0.0040
hfenergy: -475.5549535 hartree
pointgroup: C01 [X(C7H7N1O2)]
dipole: 0.3343259 -0.5152768 -0.0145405 debye
dipolederiv: -0.9625017 0.487029 0.0079877 0.5664146 -0.702927 -0.0003091 0.0105131 -0.0014964 -0.4235265 -0.8268056 -0.2611004 -0.0168654 -0.1910114 -0.9229154 -0.0232212 -0.0147205 -0.024582 -0.3307261 -0.475848 0.0577602 -0.0018039 0.0510147 -0.3156133 -0.0013254 -0.0022542 -0.0013356 -0.2470025 0.0333291 -0.3399284 -0.0126881 -0.477065 0.0244131 -0.0061481 -0.0199564 -0.0025769 0.0191883 0.1049308 0.2165443 0.0111129 -0.0851759 0.0562671 0.0045489 0.0014192 0.0090837 -0.1098639 -0.637271 -0.1324144 -0.0157064 -0.0477612 -0.1846585 -0.0090113 -0.0125524 -0.0101669 0.0523878 0.0036854 0.084913 0.0031985 0.1735086 -0.0989727 -0.0029996 0.0101374 -0.0079983 0.0467181 0.291322 -0.0001501 0.0058851 0.2468186 0.1529534 0.0110349 0.014731 0.0070344 -0.0714761 0.2310616 -0.0208171 0.0040245 0.0146433 0.1990264 0.0083862 0.0051762 0.0078045 -0.0466607 1.9249777 0.0010588 0.0272641 -0.0725773 1.343813 0.0364334 0.0251415 0.0378701 0.2401643 0.1328951 -0.0337398 -0.0014165 -0.0099785 -0.006049 -0.005124 -0.0004746 -0.0053715 0.1408523 0.0540832 0.023182 -0.0333148 0.0457508 0.0262326 -0.0996457 0.0224488 -0.117792 -0.0406342 -0.0982088 -0.0291689 -0.0074603 -0.1417159 0.0343894 -0.0074286 -0.0119994 -0.0035465 0.1136005 0.0532655 0.0116587 0.0403381 0.0411148 0.0052623 0.1062671 -0.0150659 0.1237665 -0.0176571 -0.1179016 -0.0246827 -0.0049275 -0.0281297 0.0925483 -0.0015932 -0.0052135 -0.0015064 0.1302235 0.03779 0.056275 0.0002066 0.0844075 0.0615763 -0.0013025 0.0010577 -0.0018149 0.1408508 0.2511964 -0.096419 -0.0058346 -0.1702583 0.2346541 -0.0085619 -0.0083882 -0.0073718 0.4035614 unknown
polarizability: 122.4415897|-1.7498902|95.0964804|1.2251159|1.8437816|40.7685325 unknown
InChI: InChI=1S/C7H7NO2/c1-5-2-6(7(9)10)4-8-3-5/h2-4,9H,1H3
charge 0 multiplicity 1
17 atoms
O  -2.917099 0.73388 -0.021346
O  -2.429267 -1.536413 -0.090686
N  1.079148 1.847192 0.08099
C  1.767449 -0.523127 0.011707
C  0.406735 -0.908432 -0.022791
C  -0.604631 0.082587 -0.005664
C  2.889218 -1.540984 -0.007992
C  2.036457 0.871163 0.063496
C  -0.223298 1.449469 0.046497
C  -2.027222 -0.348677 -0.043561
H  0.112637 -1.963549 -0.063116
H  2.859675 -2.150781 -0.929934
H  3.876579 -1.050986 0.041226
H  2.813124 -2.238324 0.846504
H  3.073741 1.228087 0.092636
H  -0.981363 2.237565 0.060649
H  -3.848983 0.386829 -0.048618
