program: Gaussian 09
title: 000264364
version: EM64L-G09RevD.01
frameworkgroup: C1[X(C13H23ClN2O3)]
method: RPBEPBE
basis: SDD
operation: Freq
keyword: #p
keyword: freq=noraman
keyword: PBEPBE/SDD
title: #p freq=noraman PBEPBE/SDD
converged: YES YES NO NO
title: Mulliken charges:
elementType: Cl O O O N N C C C C C C C C C C C C C H H H H H H H H H H H H H H H H H H H H H H H
charge: -0.090554 -0.268435 -0.238878 -0.315921 -0.471744 -0.409016 0.328662 -0.004550 -0.596831 -0.482515 -0.419396 -0.399089 -0.744551 0.206521 0.320870 -0.252753 -0.333847 -0.670192 -0.550124 0.206648 0.224804 0.234107 0.221706 0.267702 0.188861 0.200328 0.212496 0.197639 0.219724 0.213416 0.210546 0.288686 0.293921 0.222404 0.238146 0.240508 0.267690 0.222968 0.251026 0.218823 0.263041 0.287153
chargesum: 0.00000
title: Mulliken charges with hydrogens summed into heavy atoms:
elementType: Cl O O O N N C C C C C C C C C C C C C
charge: -0.090554 -0.268435 -0.238878 -0.315921 -0.183058 -0.115095 0.328662 0.202098 -0.137919 0.006893 -0.030208 0.011046 -0.100865 0.206521 0.320870 0.207798 0.174350 0.022625 0.000071
polarizability: 1.93008073e+02 -2.19189354e+00 1.68347331e+02 -2.99568157e+00 8.73488846e+00 1.53928536e+02
1716.lowfreq: -0.0023 -0.0021 -0.0020 1.9304 4.8132 9.1816 15.2358 29.5431 37.8208
frequency: 14.7649 29.4957 37.7740 46.1811 56.1737 72.4907 90.2691 92.4396 100.6560 122.5662 141.5722 172.4302 197.9741 217.7173 222.3871 239.3067 252.2439 280.9461 289.3547 307.5262 311.6571 328.2220 357.4118 383.8051 387.5632 424.9738 440.1642 462.3145 472.0165 503.2583 540.6082 545.6403 593.7627 680.9786 691.8501 717.0399 720.1347 738.7001 791.1598 813.8921 828.5065 848.7846 860.0472 861.8465 900.6453 919.1161 950.5425 963.3559 980.3813 985.4907 988.2605 1015.6074 1022.7630 1054.6127 1066.5914 1084.6874 1091.2176 1096.2609 1135.1275 1142.8042 1146.2361 1155.9151 1174.4480 1186.6341 1198.8185 1223.5734 1231.6369 1251.8978 1274.7219 1276.1702 1284.0976 1293.9007 1299.9964 1304.7440 1337.2450 1342.6020 1351.0381 1352.6166 1354.6490 1367.3256 1387.3165 1388.6856 1437.9702 1440.4898 1450.2371 1456.8953 1461.2548 1464.0844 1467.1795 1469.6069 1473.5163 1478.7649 1479.6167 1485.5446 1504.0432 1622.5660 1631.8842 2951.1324 2961.5166 2966.6047 2970.0413 2984.7557 2991.5682 2992.6873 3019.0079 3024.9340 3031.8932 3038.5536 3045.4691 3050.3277 3062.1426 3063.6036 3068.1934 3085.8379 3090.0091 3093.6259 3119.7587 3153.4813 3529.7424 3550.8144
redmass: 7.4156 4.6500 5.2367 4.2749 3.5575 4.2186 4.4149 3.9410 3.3424 4.1628 4.3561 2.5990 2.4536 1.2226 1.4557 2.4863 2.4932 2.2335 2.6654 2.7173 2.4767 1.7849 2.6952 3.1448 4.2410 3.0131 1.9888 2.8419 3.9311 2.3959 2.6582 1.3904 4.0899 5.1924 4.5253 3.7109 8.6243 2.7130 2.2607 1.4353 2.7590 2.1064 1.8546 1.5026 2.2756 2.3051 2.2275 1.5411 1.7016 2.4315 2.6248 2.9449 1.8335 2.0893 1.6455 1.9894 2.4023 2.2319 3.0750 1.8153 2.0609 1.6717 1.6773 2.5344 2.0944 1.4403 1.3826 1.7619 1.2223 1.1691 1.3000 1.6721 1.2177 1.2991 1.4587 1.4702 1.3632 1.4199 1.4146 1.3147 1.2131 1.2342 1.1258 1.1393 1.2120 1.0961 1.1184 1.0444 1.0945 1.2084 1.0547 1.0628 1.0980 1.0518 2.1826 7.2284 6.0420 1.0745 1.0690 1.0415 1.0563 1.0626 1.0361 1.0592 1.0698 1.0932 1.0594 1.0998 1.0974 1.0962 1.0991 1.0629 1.0992 1.0975 1.1022 1.1028 1.1065 1.1120 1.0770 1.0771
irintensity: 0.0641 1.9507 2.1079 0.8089 1.3812 6.9668 0.9121 11.4868 4.5910 2.6739 2.0454 2.9376 2.2878 1.3957 1.6288 9.2630 0.5681 1.6567 2.0174 2.5905 3.6356 7.7368 33.0162 13.4160 14.1414 2.4825 1.2878 12.3639 2.0474 5.7334 22.3734 183.0695 37.1917 2.8522 6.6180 6.5538 22.4529 11.9164 2.3553 1.1023 16.1795 5.1796 2.8608 6.6039 2.2202 2.5913 32.9738 8.7826 8.5521 5.0771 3.4964 66.4774 11.8079 6.4848 2.0510 27.0074 72.6778 4.4727 207.7273 41.5514 17.4468 8.1979 7.8652 44.0617 12.4049 15.0678 57.3620 170.6115 6.9022 14.2764 5.7589 27.9071 40.4878 5.5175 3.5490 5.8321 4.4800 3.9777 4.2480 3.7620 10.7735 26.1070 20.0431 40.6686 35.7718 12.2718 11.5239 13.5528 11.0511 0.8986 2.9768 16.6038 65.6559 11.9664 570.1475 208.4490 85.4254 7.1819 50.9125 28.4969 51.7032 27.3409 24.4220 52.3455 17.4245 41.1918 28.7559 9.4415 60.4498 7.3021 63.1191 21.5196 43.6686 36.6391 10.6964 2.3392 30.8434 15.9275 8.6936 25.2064
temp: 298.150 k
press: 1.00000 atm
elementType: 17 8 8 8 7 7 6 6 6 6 6 6 6 6 6 6 6 6 6 1 1 1 1 1 1 1 1 1 1 1 1 1 1 1 1 1 1 1 1 1 1 1
symmnumber: 1
zpe: 927343.3 jmol-1
zpe.correction: 0.353206 hartree
zpe.thermalcorrener: 0.374730 hartree
zpe.thermalcorrenthalpy: 0.375674 hartree
zpe.thermalcorrgfe: 0.300282 hartree
zpe.sumelectzpe: -1302.942203 hartree
zpe.sumelectthermal: -1302.920680 hartree
zpe.sumelectthermalent: -1302.919736 hartree
zpe.sumelectthermalfe: -1302.995128 hartree
dipole: -2.1498 -0.8816 -0.8288
dipole: 2.4669
quadrupole: -117.8883 -112.1908 -127.4178
quadrupole: -3.4909 8.3645 2.3312
quadrupole: 1.2773 6.9748 -8.2522 -3.4909 8.3645 2.3312
hfenergy: -1303.2954096 hartree
pointgroup: C01 [X(C13H23Cl1N2O3)]
dipole: 0.9148436 -0.2500246 0.2061685 debye
polarizability: 191.0874344|4.2483298|170.0327219|-6.2783783|-8.9484313|154.1637839 unknown
InChI: InChI=1S/C13H23ClN2O3/c1-3-19-11(17)13(6-4-5-10(2)9-13)16-12(18)15-8-7-14/h10,15-16H,3-9H2,1-2H3
charge 0 multiplicity 1
42 atoms
Cl -5.261845 -1.044552 1.898529
O  1.608696 2.207599 -0.622557
O  -0.13346 1.858705 0.882916
O  -1.640154 0.36354 -1.610865
N  -0.393184 -0.793247 0.007204
N  -2.725052 -1.075212 -0.119214
C  0.87517 -0.095032 -0.284965
C  2.328893 -2.120315 0.461953
C  1.958729 -0.634185 0.706053
C  1.34444 -0.335589 -1.749683
C  2.759346 -2.329631 -1.011152
C  1.684765 -1.820154 -1.998872
C  3.426654 -2.569311 1.45051
C  0.686455 1.410751 0.049966
C  -1.585795 -0.443899 -0.628903
C  1.568747 3.672489 -0.31506
C  -4.052331 -0.743365 -0.631912
C  2.392717 3.989875 0.935882
C  -4.903809 0.036772 0.370201
H  1.42721 -2.745613 0.638658
H  1.611502 -0.48928 1.750036
H  2.868447 -0.0163 0.577854
H  2.23708 0.291189 -1.925379
H  0.552919 0.010196 -2.434498
H  3.710979 -1.783704 -1.186395
H  2.968572 -3.40323 -1.186804
H  0.766879 -2.431913 -1.896313
H  2.037121 -1.94163 -3.041095
H  3.685392 -3.633483 1.297385
H  3.104813 -2.446113 2.501901
H  4.350091 -1.975249 1.308152
H  -0.447108 -1.280125 0.9039
H  -2.675276 -1.670516 0.709213
H  1.99127 4.135765 -1.22084
H  0.513534 3.971192 -0.189519
H  -4.590109 -1.656405 -0.95021
H  -3.889801 -0.108455 -1.524434
H  3.430231 3.628466 0.827737
H  1.940714 3.527213 1.829023
H  2.424009 5.084164 1.093124
H  -5.894941 0.292909 -0.033136
H  -4.384007 0.923279 0.760609
