program: Gaussian 09
title: 000256203
version: EM64L-G09RevD.01
frameworkgroup: C1[X(C12H11N5O)]
method: RPBEPBE
basis: SDD
operation: Freq
keyword: #p
keyword: freq=noraman
keyword: PBEPBE/SDD
title: #p freq=noraman PBEPBE/SDD
converged: YES YES NO NO
title: Mulliken charges:
elementType: O N N N N N C C C C C C C C C C C C H H H H H H H H H H H
charge: -0.201908 -0.279676 -0.355810 -0.024922 -0.006485 -0.699644 0.492342 0.277849 -0.110978 -0.575526 -0.248708 -0.483774 0.363533 0.318030 -0.381984 0.032543 -0.837614 -0.239398 0.250061 0.276492 0.268431 0.338293 0.236250 0.229866 0.243992 0.231556 0.238006 0.332540 0.316644
chargesum: 0.00000
title: Mulliken charges with hydrogens summed into heavy atoms:
elementType: O N N N N N C C C C C C C C C C C C
charge: -0.201908 -0.279676 -0.017517 -0.024922 -0.006485 -0.050461 0.492342 0.277849 -0.110978 -0.325466 0.027784 -0.215343 0.363533 0.318030 -0.145733 0.032543 -0.132200 -0.001391
polarizability: 2.67104745e+02 -2.99222852e+00 1.61269870e+02 -5.94679282e+00 -5.07952109e+00 9.26004311e+01
1716.lowfreq: -11.6088 -6.8256 -2.3895 -0.0005 -0.0003 -0.0002 35.3321 43.8224 60.4796
frequency: 35.2636 43.8154 60.4775 106.7104 145.6198 174.2074 181.8414 217.4447 245.5740 262.9301 292.4811 302.4911 349.2093 363.1685 393.1137 430.8619 452.6164 465.9742 486.5109 497.0217 522.6259 561.6801 577.0171 587.5984 625.7400 641.3034 649.5572 660.4236 692.9928 724.8141 745.0686 764.5641 790.2007 811.3523 857.0256 865.9204 879.0203 887.9529 929.7315 937.4531 975.9681 994.3907 1037.1725 1043.2087 1068.0483 1099.6078 1142.4806 1154.4844 1204.4271 1218.5205 1259.3056 1290.0247 1301.7621 1324.3445 1356.2056 1365.5241 1391.9022 1399.7317 1418.7451 1449.7885 1472.1696 1482.0442 1509.5712 1518.0576 1531.9559 1584.3643 1597.9419 1627.4790 1636.3798 1648.7520 2954.9818 3022.7212 3089.7494 3121.6046 3130.0706 3139.7080 3157.4437 3240.5470 3518.2541 3568.2343 3706.5430
redmass: 5.2229 6.0780 5.0788 7.3439 4.2995 1.0634 5.8319 4.2751 5.3312 5.8988 4.1794 2.8243 3.1457 3.7916 1.3918 1.1946 3.0376 3.6726 7.7190 4.0155 5.4821 4.8744 1.2702 6.0930 5.1856 3.9318 6.6661 9.8911 6.8481 2.7231 4.3368 2.3946 2.7442 1.2994 5.9524 1.7245 6.5192 1.4579 6.8173 1.3515 1.9770 2.1851 2.0386 1.5177 1.9874 2.9846 1.4752 3.3565 2.9290 1.7658 2.5723 1.4308 3.2873 2.4103 1.4640 3.8534 2.2190 2.0413 4.2196 2.9496 1.0468 1.2867 3.9935 3.9128 6.6870 6.5891 7.4012 4.1799 7.4094 1.3974 1.0397 1.0975 1.0953 1.0925 1.0885 1.0921 1.0963 1.0986 1.0794 1.0454 1.1036
irintensity: 0.1703 5.4507 2.5716 0.8150 2.5457 1.5145 0.6566 4.7072 7.8854 3.1841 0.3767 0.6139 3.6180 7.5723 152.0153 119.9100 0.6888 3.6916 2.2313 8.8036 1.3078 7.5049 92.2277 5.5176 2.7034 2.9915 1.8069 5.1663 26.9926 2.5929 0.6514 23.8907 3.9984 28.0873 1.9727 36.2560 38.9941 11.2482 46.9516 4.1697 15.4382 11.5214 0.3336 5.0458 33.5720 43.1300 14.1743 19.8265 3.0968 50.9713 3.8626 2.7985 34.8675 47.4517 19.5919 13.2993 6.2774 52.6771 5.7115 37.6628 15.7962 27.6372 33.9501 25.1985 545.0928 19.9772 64.4247 174.9047 360.0863 240.8217 42.7198 22.8432 12.9717 19.4645 16.9698 5.2999 3.5564 0.4705 58.1178 80.1444 26.9277
temp: 298.150 k
press: 1.00000 atm
elementType: 8 7 7 7 7 7 6 6 6 6 6 6 6 6 6 6 6 6 1 1 1 1 1 1 1 1 1 1 1
symmnumber: 1
zpe: 574049.6 jmol-1
zpe.correction: 0.218644 hartree
zpe.thermalcorrener: 0.233762 hartree
zpe.thermalcorrenthalpy: 0.234706 hartree
zpe.thermalcorrgfe: 0.175989 hartree
zpe.sumelectzpe: -811.597455 hartree
zpe.sumelectthermal: -811.582337 hartree
zpe.sumelectthermalent: -811.581393 hartree
zpe.sumelectthermalfe: -811.640110 hartree
dipole: -14.6948 2.8427 1.5818
dipole: 15.0506
quadrupole: -135.1941 -94.5089 -103.6530
quadrupole: 14.9864 -4.6475 -5.4361
quadrupole: -24.0754 16.6098 7.4656 14.9864 -4.6475 -5.4361
hfenergy: -811.8160989 hartree
pointgroup: C01 [X(C12H11N5O1)]
dipole: 5.7726461 -1.1313474 0.6775479 debye
polarizability: 267.0497216|-3.4991677|161.6385612|6.2183426|1.8364823|92.286763 unknown
InChI: InChI=1S/C12H11N5O/c1-7-2-3-8(4-9(7)13)17-6-16-10-11(17)14-5-15-12(10)18/h2-6,14H,13H2,1H3
charge 0 multiplicity 1
29 atoms
O  -4.996324 0.731912 -0.049762
N  -0.311896 0.576553 -0.340718
N  -1.50145 -1.469823 0.486213
N  -2.160564 1.897123 -0.668565
N  -3.907425 -1.260204 0.604814
N  4.302674 1.453164 1.032759
C  1.065754 0.163964 -0.281666
C  -1.429947 -0.179497 -0.006026
C  -2.56742 0.629505 -0.202788
C  2.004129 0.999664 0.356105
C  -0.82688 1.841051 -0.735836
C  1.458433 -1.065729 -0.861687
C  3.374035 0.621024 0.413145
C  3.79111 -0.629813 -0.157565
C  2.819178 -1.440976 -0.779045
C  -3.913649 0.111837 0.094011
C  5.246732 -1.048307 -0.090614
C  -2.796699 -1.938969 0.772265
H  1.668804 1.931077 0.826297
H  -0.168577 2.631972 -1.086662
H  0.741352 -1.676437 -1.419565
H  -0.668237 -2.041078 0.647492
H  3.137958 -2.387259 -1.231497
H  5.602232 -1.140883 0.955767
H  5.401218 -2.026055 -0.575368
H  5.908363 -0.320491 -0.602682
H  -2.835085 -2.963608 1.163192
H  5.282147 1.1933 1.09283
H  4.018132 2.341682 1.435257
