program: Gaussian 09
title: 000264330
version: EM64L-G09RevD.01
frameworkgroup: C1[X(C15H15NO3)]
method: RPBEPBE
basis: SDD
operation: Freq
keyword: #p
keyword: freq=noraman
keyword: PBEPBE/SDD
title: #p freq=noraman PBEPBE/SDD
converged: YES YES NO NO
title: Mulliken charges:
elementType: O O O N C C C C C C C C C C C C C C C H H H H H H H H H H H H H H H
charge: -0.258531 -0.263912 -0.249227 -0.460655 0.421342 0.386235 0.507303 -0.674824 -0.566215 -0.423683 -0.372677 -0.488616 0.221642 -0.420249 -0.410806 -0.241775 -0.245527 0.251030 -0.504693 0.227768 0.281005 0.226667 0.238587 0.310486 0.309141 0.292757 0.254156 0.235966 0.241771 0.227695 0.228579 0.240760 0.243014 0.235486
chargesum: 0.00000
title: Mulliken charges with hydrogens summed into heavy atoms:
elementType: O O O N C C C C C C C C C C C C C C C
charge: -0.258531 -0.263912 -0.249227 -0.151514 0.421342 0.386235 0.507303 -0.447056 -0.058543 -0.185097 -0.062191 0.058297 0.221642 -0.184283 -0.169035 -0.014080 -0.016948 0.251030 0.214567
polarizability: 3.30161273e+02 1.51493137e+01 1.68470793e+02 1.37464943e+00 1.24917056e+00 9.00413931e+01
1716.lowfreq: -4.3174 -0.0008 -0.0006 -0.0004 5.3924 7.7363 14.9629 27.6451 36.7967
frequency: 14.6053 26.9749 36.7735 55.0293 70.6922 82.6694 87.5223 140.0403 157.3426 176.7386 180.2233 186.1739 243.7005 286.4086 311.5997 318.9451 395.0789 404.3202 439.7072 475.6954 504.6617 515.7737 532.9459 560.2969 587.9560 624.7131 638.6874 648.4766 671.0659 697.6216 756.4033 758.8819 762.9540 781.6678 805.1606 839.4792 848.7302 872.3043 877.7505 903.4040 938.6258 953.8867 961.4167 968.9105 988.8201 1003.4404 1017.8530 1023.0765 1084.1461 1114.0229 1125.1447 1138.8337 1149.6304 1154.0229 1161.5935 1172.0349 1179.9767 1209.3527 1243.1349 1248.7076 1277.9523 1293.1934 1315.5127 1345.2626 1365.5116 1403.8936 1419.9658 1423.7124 1437.3022 1443.1149 1452.4681 1452.8089 1464.1080 1464.2475 1498.2765 1533.9620 1586.3903 1608.6104 1624.7703 1641.6714 1643.7922 2983.1247 2997.6087 3005.1916 3037.8110 3075.4484 3102.0190 3107.0553 3118.9360 3124.5976 3132.1198 3142.3055 3150.2140 3162.1211 3195.9109 3519.3605
redmass: 4.7625 4.7347 4.2139 5.6322 3.1382 1.2120 3.4885 4.0161 4.1556 5.0368 4.2961 3.7697 4.1992 6.3233 4.4788 5.1539 4.3881 3.1701 4.3340 2.4469 5.0896 6.2290 3.2964 2.5764 4.1376 6.4529 6.0539 1.6611 1.7070 4.5005 3.8314 1.3663 4.2920 2.3663 2.1682 1.2603 4.8684 1.5711 5.3024 1.9257 4.8812 5.5914 1.3907 4.6868 1.3317 1.3345 2.1266 2.2434 3.5604 1.2671 1.7422 1.9424 1.4534 1.8877 1.2232 1.1286 1.5958 1.5479 1.6500 1.2398 1.7970 2.2230 1.5143 2.0161 1.8237 3.4564 3.7526 1.1985 4.6912 1.0826 1.0892 1.0639 1.1026 2.0047 2.7960 2.9746 6.6688 5.4785 4.9085 8.3501 6.6767 1.0602 1.0636 1.0301 1.0993 1.0961 1.0913 1.1046 1.0859 1.0889 1.0907 1.0947 1.1048 1.1003 1.0948 1.0762
irintensity: 0.5106 0.8247 0.4155 5.0595 2.1125 0.3473 1.3858 6.6383 1.9457 6.6796 6.7372 1.8954 13.6611 29.0307 9.1568 3.5733 2.1465 0.4336 5.5039 23.8317 9.4294 3.9470 2.7127 2.1950 10.6898 3.7183 7.3293 44.1710 27.9256 3.3619 3.1842 38.3925 2.5400 3.6816 20.4500 6.8162 6.5250 102.8875 1.8054 10.2040 8.4162 40.0313 11.1768 1.3114 0.0004 0.6172 18.2357 4.1960 26.2771 0.5897 9.6247 172.9271 24.1254 203.4875 2.5973 2.5963 8.3460 30.4650 33.2932 116.0729 6.0058 28.2252 73.4215 207.2997 3.6293 57.5680 63.0700 26.9783 27.0958 2.1280 52.1417 16.4475 13.6871 2.3584 436.4069 36.0394 25.5387 90.9578 184.7422 123.0434 53.5753 13.0166 50.5258 28.3623 11.8266 9.1790 19.2096 27.1290 6.2218 0.0689 9.8006 34.6690 16.8303 38.8578 10.6582 10.3286
temp: 298.150 k
press: 1.00000 atm
elementType: 8 8 8 7 6 6 6 6 6 6 6 6 6 6 6 6 6 6 6 1 1 1 1 1 1 1 1 1 1 1 1 1 1 1
symmnumber: 1
zpe: 703799.9 jmol-1
zpe.correction: 0.268063 hartree
zpe.thermalcorrener: 0.285702 hartree
zpe.thermalcorrenthalpy: 0.286646 hartree
zpe.thermalcorrgfe: 0.219273 hartree
zpe.sumelectzpe: -859.688678 hartree
zpe.sumelectthermal: -859.671039 hartree
zpe.sumelectthermalent: -859.670094 hartree
zpe.sumelectthermalfe: -859.737468 hartree
dipole: 0.2298 -2.3672 -1.4248
dipole: 2.7725
quadrupole: -85.3750 -105.9729 -118.3367
quadrupole: -0.2204 -5.9711 3.9140
quadrupole: 17.8532 -2.7447 -15.1085 -0.2204 -5.9711 3.9140
hfenergy: -859.9567409 hartree
pointgroup: C01 [X(C15H15N1O3)]
dipole: 0.0932231 -0.8899812 -0.6237405 debye
polarizability: 330.1616381|14.742327|167.8706093|3.9974087|6.8015211|90.6412119 unknown
InChI: InChI=1S/C15H15NO3/c1-19-15(18)9-8-14(17)16-13-7-6-11-4-2-3-5-12(11)10-13/h2-7,10,16H,8-9H2,1H3
charge 0 multiplicity 1
34 atoms
O  1.554818 1.571925 0.364227
O  6.421777 0.317716 -0.552814
O  5.516803 -1.131632 1.029128
N  0.386424 -0.437057 0.003322
C  -3.354086 -0.672844 -0.095175
C  -3.740251 0.710024 0.103533
C  -0.977687 -0.02437 0.046628
C  -1.965371 -1.008422 -0.118889
C  2.83735 -0.511116 0.119046
C  -2.707346 1.689492 0.270451
C  -1.356433 1.348639 0.245573
C  4.040547 0.351828 -0.29688
C  1.546201 0.320251 0.165187
C  -4.381534 -1.661634 -0.262446
C  -5.132305 1.050046 0.126482
C  -5.730133 -1.29995 -0.235678
C  -6.110859 0.066925 -0.039854
C  5.357933 -0.255463 0.146625
C  7.775087 -0.147226 -0.160331
H  -1.679461 -2.058588 -0.269632
H  3.031925 -0.91879 1.131267
H  2.727245 -1.383042 -0.553509
H  -2.993205 2.737148 0.422098
H  -0.573712 2.097869 0.373238
H  0.530973 -1.437788 -0.15438
H  3.933207 1.3493 0.174628
H  4.068815 0.534731 -1.38466
H  -4.093263 -2.709167 -0.412602
H  -5.41893 2.097682 0.277569
H  -6.506066 -2.062687 -0.364617
H  -7.172685 0.335434 -0.020985
H  7.871847 -1.232085 -0.334203
H  7.957256 0.065561 0.90642
H  8.462818 0.420992 -0.80177
