program: Gaussian 09
title: 000023069
version: EM64L-G09RevD.01
frameworkgroup: C1[X(C5H5NO2)]
method: RPBEPBE
basis: SDD
operation: Freq
keyword: #pfreq=noraman
keyword: PBEPBE/SDD
title: #p freq=noraman PBEPBE/SDD
converged: NO NO YES YES
title: Mulliken charges:
elementType: O O N C C C C C H H H H H
charge: -0.418909 -0.348287 0.057335 0.305641 -0.348605 -0.306939 -0.145168 -0.226379 0.276553 0.269536 0.282885 0.237880 0.364458
chargesum: 0.00000
title: Mulliken charges with hydrogens summed into heavy atoms:
elementType: O O N C C C C C
charge: -0.054451 -0.348287 0.057335 0.305641 -0.072053 -0.037403 0.092711 0.056506
polarizability: 9.66869660e+01 -5.79961608e+00 8.20579670e+01 3.76851025e-04 -1.74842981e-03 2.69581567e+01
1716.lowfreq: -0.9425 0.0006 0.0009 0.0011 12.2456 14.6191 204.1819 224.8526 331.3076
frequency: 204.1819 224.8522 331.3075 373.8277 447.1537 491.2949 516.5888 536.6797 603.4722 661.9339 742.1240 765.6222 811.9983 849.7642 953.0533 959.9594 992.6305 1073.9184 1138.2548 1159.1150 1186.0037 1289.0101 1293.2036 1315.4883 1439.4621 1476.4721 1564.3085 1610.1622 3166.2015 3185.3661 3200.1611 3220.9969 3578.0138
redmass: 5.7492 4.3443 5.9248 1.1370 2.8144 4.8343 7.5812 8.6319 4.7912 2.0135 7.9489 1.3075 1.8545 1.4427 1.2962 2.8562 6.1872 1.5819 1.6939 1.1559 1.7095 5.6790 3.8570 1.3841 2.2947 3.3779 5.6183 6.0719 1.0897 1.0931 1.0954 1.0971 1.0662
irintensity: 5.2552 1.8029 18.3633 150.0708 18.2428 1.6448 7.7261 5.6899 0.0649 33.8832 4.1601 29.7405 86.2963 0.9420 0.6252 16.7772 12.2224 21.1537 277.9064 10.2614 18.2712 1.0596 40.9650 22.3100 23.8435 56.4715 92.6685 90.6822 6.9894 0.8942 0.2472 0.4796 47.6813
temp: 298.150 k
press: 1.00000 atm
elementType: 8 8 7 6 6 6 6 6 1 1 1 1 1
symmnumber: 1
zpe: 247403.2 jmol-1
zpe.correction: 0.094231 hartree
zpe.thermalcorrener: 0.100643 hartree
zpe.thermalcorrenthalpy: 0.101587 hartree
zpe.thermalcorrgfe: 0.063870 hartree
zpe.sumelectzpe: -398.082730 hartree
zpe.sumelectthermal: -398.076318 hartree
zpe.sumelectthermalent: -398.075374 hartree
zpe.sumelectthermalfe: -398.113091 hartree
dipole: -2.7168 0.9186 0.0000
dipole: 2.8679
quadrupole: -54.9073 -36.2806 -48.8413
quadrupole: 9.5911 -0.0005 -0.0003
quadrupole: -8.2309 10.3958 -2.1649 9.5911 -0.0005 -0.0003
hfenergy: -398.1769607 hartree
pointgroup: C01 [X(C5H5N1O2)]
dipole: 1.0836801 -0.314203 -0.0000057 debye
dipolederiv: -1.0541917 -0.5705748 -0.0000284 -0.6232712 -0.4334947 -0.0000008 -0.0000279 0.000011 -0.4307275 -0.9396909 0.3216518 -0.0000144 0.380332 -0.5581675 0.0000081 0.0000825 -0.0000511 -0.3334198 0.9541161 -0.3062535 -0.0000104 -0.4607133 0.5429212 0.0000113 -0.0000876 0.0000668 0.1413488 1.1225376 0.4634891 0.0000321 0.5693832 0.5836914 0.0000194 0.0000285 0.0000054 0.1461373 -0.6010137 -0.0500342 0.0000175 -0.0666157 0.0292875 0.0000144 0. 0.0000037 -0.2127884 -0.2561001 -0.0317589 0.0000012 -0.316706 -0.2984645 -0.0000106 0.0000022 -0.0000129 -0.2134881 0.3605767 -0.0073825 0.0000035 -0.0199411 0.1727054 0.0000027 0.0000049 0.0000106 -0.0777935 -0.1099213 0.0186153 -0.0000018 0.3849105 -0.2842145 -0.0000252 0.0000069 -0.0000087 -0.1817203 0.0558206 -0.0071071 -0.0000071 -0.0301471 0.0094987 -0.000008 -0.0000058 -0.0000105 0.2100178 0.0065729 0.0495645 -0.000001 0.04598 0.0782687 -0.0000014 -0.0000031 0.0000009 0.1931398 0.0269685 -0.0303401 0.000001 0.0095179 0.0729317 0.000003 0.000005 0.0000019 0.2042421 0.112887 -0.0099784 0.0000013 -0.0137103 -0.0709667 -0.0000017 -0.0000097 -0.0000036 0.1563081 0.3214384 0.1601088 0.0000067 0.140981 0.1560032 -0.0000112 0.0000039 -0.0000137 0.3987436 unknown
polarizability: 97.1667806|-5.1367419|81.5781524|-0.0004531|0.0017302|26.9581567 unknown
InChI: InChI=1S/C5H5NO2/c7-5-2-1-3-6(8)4-5/h1-4,7H
charge 0 multiplicity 1
13 atoms
O  2.431156 0.996709 0.000025
O  -2.382408 1.055144 0.000043
N  -1.240387 0.371692 -0.000086
C  1.195602 0.341951 -0.00001
C  -0.020157 1.048466 -0.000014
C  1.211451 -1.074274 -0.000058
C  -0.035979 -1.734377 -0.000066
C  -1.243072 -1.023985 -0.000062
H  -0.108598 2.137416 0.000028
H  2.161544 -1.61115 -0.000057
H  -2.236009 -1.473151 -0.000045
H  -0.081902 -2.827255 -0.000072
H  2.32526 1.981014 0.000074
