program: Gaussian 09
title: 000264302
version: EM64L-G09RevD.01
frameworkgroup: C1[X(C11H8N2)]
method: RPBEPBE
basis: SDD
operation: Freq
keyword: #pfreq=noraman
keyword: PBEPBE/SDD
title: #p freq=noraman PBEPBE/SDD
converged: YES YES NO NO
title: Mulliken charges:
elementType: N N C C C C C C C C C C C H H H H H H H H
charge: -0.009647 -0.020645 0.421254 -0.100171 0.089365 -0.296318 -0.318741 -0.386231 -0.314730 -0.495953 -0.246773 -0.218239 -0.140058 0.247917 0.259326 0.237430 0.263880 0.280069 0.280056 0.233144 0.235066
chargesum: 0.00000
title: Mulliken charges with hydrogens summed into heavy atoms:
elementType: N N C C C C C C C C C C C
charge: -0.009647 -0.020645 0.421254 -0.100171 0.089365 -0.048401 -0.059416 -0.148801 -0.050850 0.064172 -0.013629 0.016827 -0.140058
polarizability: 2.05835303e+02 1.02110786e+01 1.24219898e+02 -4.17429146e-02 6.08083273e-03 5.38676892e+01
1716.lowfreq: -15.8013 -9.3325 -0.4735 0.0002 0.0005 0.0007 14.8519 105.5933 108.7975
frequency: 14.1198 105.5927 108.7961 173.0898 241.9661 269.0740 355.3473 385.0832 397.1569 411.7182 477.7453 517.5522 518.6707 576.9925 613.4747 655.4995 724.3088 752.1128 757.5903 795.7675 836.6068 858.9051 888.9173 929.4897 934.7401 967.9172 974.4218 991.8363 999.2624 1016.3018 1113.6035 1154.3695 1167.9139 1197.2885 1219.5683 1242.0584 1265.9018 1267.9943 1314.0287 1358.4543 1406.2304 1421.3545 1430.1270 1459.8499 1506.9783 1552.6761 1592.1443 1625.9589 2204.3830 3002.0849 3052.9356 3124.4682 3133.9102 3139.4025 3157.2052 3166.9098 3172.0325
redmass: 4.8624 3.4370 8.7704 4.1846 6.2215 3.5336 3.7436 7.8774 3.4729 4.8949 2.9783 7.0667 3.2696 8.5673 7.5879 3.4960 4.7745 5.6627 1.2684 2.6990 1.3508 6.2821 1.7432 4.8785 2.0595 1.3645 3.5629 1.3807 1.3372 2.1740 1.8164 1.2157 1.1103 1.0980 1.9997 2.0575 2.2503 1.8502 2.3620 3.3584 4.7307 1.7764 1.2547 2.9845 3.5019 7.3834 6.3418 6.6262 12.4596 1.0596 1.0989 1.0873 1.0898 1.0893 1.0950 1.0969 1.0996
irintensity: 7.7712 6.1654 5.0830 6.0686 1.6084 2.7565 0.1417 2.1465 0.8818 5.9795 10.7979 0.0372 0.1103 0.6397 4.2900 0.1325 2.6290 2.0375 39.6311 16.4098 66.3054 0.4786 1.2199 2.7215 11.3503 4.4669 1.6039 0.7631 0.0811 6.0100 8.5894 0.3413 1.8070 0.5185 10.9180 6.8838 6.9200 5.3761 11.3496 7.5797 8.1181 32.2251 7.3488 1.5129 55.1826 14.8027 41.6767 9.3370 13.4241 0.9348 0.3767 2.3833 5.7268 11.4635 22.1905 6.1871 19.8953
temp: 298.150 k
press: 1.00000 atm
elementType: 7 7 6 6 6 6 6 6 6 6 6 6 6 1 1 1 1 1 1 1 1
symmnumber: 1
zpe: 416897.9 jmol-1
zpe.correction: 0.158788 hartree
zpe.thermalcorrener: 0.168987 hartree
zpe.thermalcorrenthalpy: 0.169931 hartree
zpe.thermalcorrgfe: 0.121465 hartree
zpe.sumelectzpe: -532.583507 hartree
zpe.sumelectthermal: -532.573308 hartree
zpe.sumelectthermalent: -532.572364 hartree
zpe.sumelectthermalfe: -532.620830 hartree
dipole: -4.1287 0.0246 0.0007
dipole: 4.1288
quadrupole: -85.8409 -67.7212 -77.8916
quadrupole: -7.8008 -0.0106 -0.0030
quadrupole: -8.6896 9.4301 -0.7404 -7.8008 -0.0106 -0.0030
hfenergy: -532.7422947 hartree
pointgroup: C01 [X(C11H8N2)]
dipole: -1.6066738 -0.220302 -0.0931921 debye
dipolederiv: -0.6228675 -0.0536961 -0.022221 -0.1112369 -0.3304199 0.0244396 0.0013058 0.0312973 -0.2528189 -0.3500346 0.0008818 -0.0136371 -0.0920013 -0.231348 -0.0121277 0.0248506 -0.0014215 -0.2315747 -0.0725086 0.04629 -0.0359685 -0.1636579 -0.2036602 0.095639 0.0510686 0.1195208 0.0286647 0.3005276 0.0274015 0.0162131 0.2694766 0.0659105 0.029206 -0.0840126 0.0015343 0.051685 0.8413244 -0.0339566 0.1082017 -0.3860308 0.1938937 -0.1119082 0.2551383 -0.0716022 0.0898011 0.2506938 -0.0239564 0.0530882 0.0781753 0.1709134 -0.114385 0.0108072 -0.1261501 -0.0730243 -0.3960679 0.1029938 -0.0754873 0.3028903 -0.1102964 0.0339665 -0.1588405 0.0110635 -0.1350654 0.0137403 -0.0207023 0.0292001 -0.0772219 0.0644311 -0.1046183 0.0526048 -0.0981357 -0.1204439 -0.1404009 -0.0422548 0.0198712 -0.0244637 0.0694952 -0.098564 0.0126225 -0.1005621 -0.1190375 -0.0786194 -0.0416716 -0.0133127 0.0973794 0.0621632 0.0623259 -0.0714266 0.0462178 0.1575432 0.0675919 -0.0922776 0.0631378 -0.1177301 -0.0710005 -0.0467469 0.0736538 -0.0438144 -0.124884 -0.021417 0.1008913 -0.027084 0.1275457 0.0744439 -0.0780321 -0.0379341 -0.0810552 -0.120223 0.1028088 0.1118888 -0.0303635 0.2356148 0.0648123 -0.0146759 -0.0817178 -0.0289126 -0.0335487 0.0612476 0.0594364 -0.033944 0.0167571 -0.0353216 0.0756374 -0.016094 0.0805419 0.1071449 0.0360376 -0.0813474 0.0194405 -0.0993139 0.0519147 0.0338702 0.026776 0.0359823 0.1493167 0.0581646 0.0027059 -0.0126673 0.0726309 -0.0541583 0.0967135 -0.0415589 0.0887032 0.1179668 0.0899492 0.0555919 -0.0311027 0.0015958 -0.0118278 0.0716035 -0.0088353 0.0777613 0.1276845 -0.0057153 -0.0096227 0.0187871 -0.004973 0.0235465 -0.0482663 0.0512713 -0.0593826 0.0981357 0.0088906 -0.0367785 -0.0087124 -0.0542377 0.1085667 0.0214433 -0.0359116 0.0340419 -0.0015765 -0.115793 0.0356736 -0.04647 0.0371043 0.0932411 0.032662 -0.0471088 0.0324889 0.1431325 -0.0275521 -0.1074909 0.0230308 -0.1083031 0.0047003 0.0518175 0.0233413 0.0518831 0.1411215 unknown
polarizability: 200.9913986|23.2664302|118.2865623|7.2320577|-24.0160349|64.6449291 unknown
InChI: InChI=1S/C11H8N2/c12-8-7-10-6-5-9-3-1-2-4-11(9)13-10/h1-6H,7H2
charge 0 multiplicity 1
21 atoms
N  0.409403 -0.879006 0.582199
N  4.720311 1.319152 0.16973
C  -1.271389 0.735267 -0.279015
C  -0.906486 -0.545896 0.293214
C  1.371625 0.026474 0.317505
C  -0.213771 1.663754 -0.543207
C  1.105768 1.316726 -0.248189
C  -2.649933 1.013739 -0.551613
C  -1.932212 -1.504797 0.572777
C  2.787537 -0.441671 0.676401
C  -3.630727 0.060654 -0.268898
C  -3.268471 -1.205391 0.296211
C  3.855067 0.530034 0.396938
H  -0.448623 2.642988 -0.976223
H  1.930687 2.008773 -0.440562
H  -2.923496 1.98362 -0.984263
H  -1.630589 -2.464181 1.004047
H  2.996841 -1.37993 0.128535
H  2.807904 -0.705668 1.750751
H  -4.684095 0.276027 -0.478238
H  -4.050351 -1.941865 0.511399
