program: Gaussian 09
title: 000264291
version: EM64L-G09RevD.01
frameworkgroup: C1[X(C8H6ClNO3)]
method: RPBEPBE
basis: SDD
operation: Freq
keyword: #p
keyword: freq=noraman
keyword: PBEPBE/SDD
title: #p freq=noraman PBEPBE/SDD
converged: YES YES NO NO
title: Mulliken charges:
elementType: Cl O O O N C C C C C C C C H H H H H H
charge: -0.001463 -0.168394 -0.196749 -0.193377 0.029486 0.310241 -0.312319 -0.316046 0.388240 -0.363945 -0.354793 0.200246 -0.716933 0.250478 0.291971 0.292456 0.294762 0.283075 0.283063
chargesum: 0.00000
title: Mulliken charges with hydrogens summed into heavy atoms:
elementType: Cl O O O N C C C C C C C C
charge: -0.001463 -0.168394 -0.196749 -0.193377 0.029486 0.310241 -0.061841 -0.024075 0.388240 -0.071489 -0.060031 0.200246 -0.150795
polarizability: 1.91477478e+02 6.16847371e+00 1.14371779e+02 -4.83239279e-03 6.04851663e-03 4.60414894e+01
1716.lowfreq: -5.7480 0.0026 0.0029 0.0032 8.4205 11.8569 32.5674 57.1514 72.6768
frequency: 32.5490 57.1226 72.6644 93.9075 102.7170 210.4924 220.8779 235.2410 288.2410 394.7402 404.6786 434.2972 486.4764 515.7212 558.4547 623.2471 654.0496 665.4942 735.8375 737.8785 756.2339 800.3591 843.5252 873.3613 931.8939 990.0912 991.8867 1006.9956 1016.4868 1090.3867 1112.6012 1154.2560 1183.5595 1198.1962 1218.7813 1285.6993 1302.2000 1369.2219 1403.5894 1411.7039 1417.2707 1475.8727 1587.2253 1603.1369 1624.8331 3029.4026 3101.7074 3156.4024 3163.1631 3185.2638 3188.1119
redmass: 11.1903 6.8035 5.4169 3.6755 10.7880 12.2624 11.1428 6.3015 9.2159 8.1611 2.8541 3.7150 9.2589 6.3355 2.5896 7.1208 8.9364 4.3757 8.0328 3.9278 7.3536 8.2034 1.4008 1.3809 2.0327 5.0639 1.3751 2.7192 1.3599 3.2324 1.3215 1.0904 1.3445 2.5714 5.4469 1.5754 1.3237 7.2848 11.0133 3.3940 1.1412 2.3038 8.2708 6.5003 9.1388 1.0569 1.1063 1.0896 1.0902 1.0951 1.0964
irintensity: 0.2584 6.0701 7.9601 0.3995 4.1626 1.3065 1.1511 1.3204 1.9870 1.8411 0.0166 1.8530 9.6902 2.2165 5.4544 0.3483 9.4705 25.8727 97.4666 7.0586 0.3368 14.0878 32.5329 36.6732 2.1199 40.6785 2.3461 0.2598 0.0380 10.2243 16.6009 2.3762 24.3695 260.8708 148.8886 24.9771 7.2990 75.5270 1.4217 61.6560 42.0026 0.4495 31.6045 7.0279 52.4292 24.9119 2.2831 7.0724 2.5009 1.5829 1.8981
temp: 298.150 k
press: 1.00000 atm
elementType: 17 8 8 8 7 6 6 6 6 6 6 6 6 1 1 1 1 1 1
symmnumber: 1
zpe: 334943.1 jmol-1
zpe.correction: 0.127573 hartree
zpe.thermalcorrener: 0.139190 hartree
zpe.thermalcorrenthalpy: 0.140134 hartree
zpe.thermalcorrgfe: 0.087673 hartree
zpe.sumelectzpe: -1047.908818 hartree
zpe.sumelectthermal: -1047.897201 hartree
zpe.sumelectthermalent: -1047.896257 hartree
zpe.sumelectthermalfe: -1047.948717 hartree
dipole: 1.0046 -2.2860 0.0001
dipole: 2.4970
quadrupole: -118.8441 -78.5185 -80.5012
quadrupole: -9.5905 -0.0003 0.0020
quadrupole: -26.2228 14.1028 12.1201 -9.5905 -0.0003 0.0020
hfenergy: -1048.0363909 hartree
pointgroup: C01 [X(C8H6Cl1N1O3)]
dipole: -0.3631753 0.9127901 -0.0030113 debye
dipolederiv: -0.5391868 0.0522922 -0.0003573 -0.0108807 -0.0902546 -0.0001141 -0.000137 -0.000092 -0.128437 -0.7679275 -0.0963672 -0.0000738 -0.2143948 -0.673852 0.0009053 0.0003621 0.001134 -0.2780045 -0.7122707 -0.1923447 0.0002817 -0.1675992 -0.6745991 0.0013371 0.0002258 0.0014078 -0.2207172 -0.7529821 0.1893364 -0.0010071 0.1537063 -0.628641 0.0015001 -0.0008434 0.0014274 -0.2183358 1.7933895 0.0368604 0.0009946 0.0480818 1.0903467 -0.0029337 0.0009915 -0.0029209 0.1921982 -0.6048138 -0.0053109 -0.0003751 0.1302517 0.0104654 0.0000146 -0.000817 -0.0000511 0.0052013 -0.0335589 -0.1999544 0.0007177 -0.0506344 -0.0010858 -0.0004212 0.0002529 -0.0005574 -0.1260863 -0.1647834 0.2176999 -0.0007375 -0.0149978 0.0316606 -0.0003772 -0.0000798 -0.000202 -0.0831533 -0.5757602 -0.0340004 -0.0003225 -0.0610661 0.1169387 -0.0001754 -0.0002928 -0.0001661 0.0710152 -0.0035572 0.1768137 -0.0004942 -0.0458392 -0.0555663 -0.0001691 0.0001995 -0.0000183 -0.0987972 0.0513245 -0.197402 0.000759 0.1085749 -0.0603362 -0.0000789 -0.0002695 -0.0002902 -0.1030096 1.5129091 0.0044012 0.0008956 -0.2798563 0.842051 -0.0020698 0.0016996 -0.0020448 0.1341748 0.5580539 0.1032141 -0.0001403 0.3886729 -0.2205468 0.0013155 -0.0009427 0.0011388 0.1698505 0.040702 0.084543 -0.0003521 0.1132181 -0.004987 0.0005461 -0.0004481 0.000537 0.1430719 0.1112204 -0.0586349 0.0001589 -0.0192797 0.0454206 0.0003367 0.0000523 0.0003012 0.1532635 0.1092688 -0.0504815 0.000116 -0.0230018 0.0639895 0.000331 0.0000276 0.0003172 0.1731934 0.0913748 0.0579207 -0.0002458 0.0244945 0.0802189 0.0003178 -0.0001318 0.0003471 0.1728424 -0.0566766 -0.0444515 -0.0627725 -0.039908 0.0640673 -0.0534294 -0.0677315 -0.0597378 0.0211368 -0.056726 -0.0441344 0.0629547 -0.0395424 0.06471 0.0531646 0.0678823 0.0594703 0.020593 unknown
polarizability: 191.8170844|3.4272886|114.0314401|0.0837557|-0.2136526|46.0422214 unknown
InChI: InChI=1S/C8H6ClNO3/c9-5-8(11)6-1-3-7(4-2-6)10(12)13/h1-4H,5H2
charge 0 multiplicity 1
19 atoms
Cl -5.121436 0.638441 -0.00629
O  -2.980662 -1.464657 0.000681
O  3.849709 1.305173 -0.003314
O  3.998827 -0.971758 0.004263
N  3.324114 0.127011 0.000328
C  -0.960151 -0.150763 -0.001954
C  -0.324701 1.121315 -0.005538
C  -0.16506 -1.32981 0.002412
C  1.837942 0.028974 -0.000449
C  1.079766 1.218695 -0.004825
C  1.237737 -1.249759 0.003214
C  -2.461796 -0.320751 -0.002494
C  -3.296258 0.966056 -0.006527
H  -0.912514 2.044524 -0.008915
H  -0.676666 -2.297293 0.005137
H  1.593861 2.183166 -0.007547
H  1.869159 -2.141847 0.006569
H  -3.08122 1.569924 0.891011
H  -3.080549 1.564758 -0.907363
