program: Gaussian 09
title: 000264335
version: EM64L-G09RevD.01
frameworkgroup: C1[X(C18H21NO4)]
method: RPBEPBE
basis: SDD
operation: Freq
keyword: #p
keyword: freq=noraman
keyword: PBEPBE/SDD
title: #p freq=noraman PBEPBE/SDD
converged: YES YES NO NO
title: Mulliken charges:
elementType: O O O O N C C C C C C C C C C C C C C C C C C H H H H H H H H H H H H H H H H H H H H H
charge: -0.273874 -0.260106 -0.214985 -0.230267 -0.032732 -0.408567 -0.304010 -0.542125 0.173575 0.266152 0.228124 -0.329273 -0.112392 0.442908 -0.330096 -0.336594 -0.402252 -0.237064 -0.261193 -0.224154 -0.251405 -0.680826 -0.665191 0.221654 0.240142 0.270043 0.280237 0.207388 0.236134 0.242670 0.273905 0.235384 0.257552 0.225678 0.227548 0.237578 0.232712 0.229556 0.212237 0.224838 0.239838 0.217373 0.248574 0.225306
chargesum: 0.00000
title: Mulliken charges with hydrogens summed into heavy atoms:
elementType: O O O O N C C C C C C C C C C C C C C C C C C
charge: -0.273874 -0.260106 -0.214985 -0.230267 -0.032732 0.053229 -0.033967 -0.054499 0.173575 0.266152 0.228124 -0.093139 -0.112392 0.442908 -0.087426 -0.062689 -0.166867 0.246166 0.203933 0.008558 -0.021850 -0.003913 0.026062
polarizability: 2.81106840e+02 3.26457139e+01 1.75035440e+02 -4.00338673e-01 -3.06175670e+01 1.80178965e+02
1716.lowfreq: -12.4504 -6.6318 -4.1917 0.0003 0.0008 0.0009 3.8781 19.5529 25.7160
frequency: -1.7255 18.8096 25.3401 35.5038 48.9280 52.3551 69.0019 80.6218 90.9322 109.4476 115.6841 144.5544 165.6683 175.2493 185.8238 205.0080 244.2651 250.1112 267.1541 268.8024 311.2913 328.8009 364.3342 378.8544 396.8429 410.3561 427.1421 461.7148 480.0319 489.5355 517.8320 547.4928 558.8920 610.2014 649.6914 665.8420 673.7568 702.3977 748.0904 754.4858 765.0195 783.9986 800.0810 803.3423 808.5205 829.5612 835.6724 840.3168 870.8600 884.6973 887.7175 911.1352 931.0109 965.2166 983.6466 993.6726 997.9806 1002.8144 1015.9568 1017.5138 1028.0299 1085.1207 1095.6575 1108.6642 1111.4889 1118.2348 1138.5117 1142.9061 1149.5262 1157.6708 1165.3156 1174.3763 1208.5536 1228.0777 1237.7589 1251.7154 1264.1664 1269.4368 1278.0725 1296.9239 1305.6362 1334.4293 1351.4920 1358.0881 1360.2441 1369.0220 1388.9177 1398.7312 1402.8472 1418.2422 1454.7425 1457.8142 1462.5295 1462.9058 1464.3762 1470.1982 1474.8826 1484.7756 1486.4759 1500.9638 1550.4366 1596.7513 1624.0246 1640.3156 1645.0418 2992.0685 2993.4739 2994.6230 3004.5092 3014.1614 3018.4958 3033.4142 3062.9465 3075.8617 3086.8849 3091.3901 3094.5389 3095.8265 3107.5692 3118.3768 3120.9932 3121.3039 3135.8271 3148.4856 3154.0179 3169.1769
redmass: 4.7914 3.5875 4.6810 5.1310 3.4676 3.5653 5.1360 6.6369 3.0140 3.4972 4.3633 3.0027 3.8249 4.2201 3.4584 1.5568 1.9291 1.5903 2.3546 2.7913 4.0491 4.1906 3.6071 3.8184 3.4312 3.4508 3.5274 3.7465 2.9834 4.4208 6.9560 4.6613 4.3742 7.0659 3.8395 4.1646 5.1234 3.2075 4.4373 4.0290 1.4084 2.4713 3.1431 1.1361 1.6938 2.6458 2.9965 1.7867 4.3438 2.5299 1.7175 3.0482 4.3086 1.3534 1.3819 2.2525 1.3266 2.7919 2.3358 2.3368 2.8166 3.9519 2.1628 1.9375 2.3420 2.5865 1.4909 1.5531 1.5710 1.5789 1.1219 1.6392 1.2959 1.5830 2.0935 1.1345 1.8153 1.5306 1.1299 2.5602 1.7405 1.4821 1.3199 1.3782 1.3763 3.2305 1.2350 1.2643 4.9442 2.1974 1.1831 1.1003 1.4144 1.4422 1.0449 1.1194 1.0600 1.0519 1.0708 3.4688 7.3346 6.4207 6.6699 10.1434 10.0873 1.0360 1.0655 1.0357 1.0665 1.0595 1.0771 1.0595 1.1030 1.1047 1.0973 1.0983 1.1027 1.0945 1.1032 1.0874 1.0876 1.1066 1.0890 1.0978 1.0947 1.0994
irintensity: 0.0804 0.8050 0.3015 0.6828 1.2674 1.6286 0.0861 0.0359 1.2268 0.2380 1.7041 1.6780 2.9340 5.7170 3.4166 5.3691 0.3280 0.6550 3.6450 1.6914 6.0318 27.2389 4.2318 0.6628 0.7648 5.8060 2.1574 0.9454 9.5310 2.2942 0.0448 9.2383 6.4023 3.1113 3.7585 0.5161 0.2913 4.4168 1.7347 6.9434 48.9048 9.5310 3.5585 11.1411 9.2107 15.0251 22.1809 41.8295 2.0398 2.4623 1.2316 4.0313 2.3392 2.9718 4.1749 25.2051 0.3594 8.2620 34.2405 20.4286 204.8642 74.6641 35.8924 82.3119 43.1100 255.9326 1.4591 48.8120 40.6978 13.7611 2.0671 47.2256 14.8826 8.8693 10.1255 0.2678 3.3705 22.6529 8.3832 25.0000 91.6916 23.4391 6.2177 11.7361 0.9917 6.6615 22.9325 18.8512 2.3649 12.3655 9.4988 10.4604 9.4510 7.3683 14.2782 13.2954 3.1434 12.1928 14.8682 35.2682 16.6541 42.3756 10.5624 138.7309 154.6479 23.3790 14.5588 17.9946 26.9365 16.0007 14.6989 23.1548 32.2706 2.3145 34.9489 21.1574 2.3827 3.6717 45.7242 3.0980 9.2496 30.5645 11.8629 21.8966 24.3721 19.6358
temp: 298.150 k
press: 1.00000 atm
elementType: 8 8 8 8 7 6 6 6 6 6 6 6 6 6 6 6 6 6 6 6 6 6 6 1 1 1 1 1 1 1 1 1 1 1 1 1 1 1 1 1 1 1 1 1
symmnumber: 1
zpe: 930501.0 jmol-1
zpe.correction: 0.354409 hartree
zpe.thermalcorrener: 0.376418 hartree
zpe.thermalcorrenthalpy: 0.377362 hartree
zpe.thermalcorrgfe: 0.300975 hartree
zpe.sumelectzpe: -1052.478646 hartree
zpe.sumelectthermal: -1052.456637 hartree
zpe.sumelectthermalent: -1052.455693 hartree
zpe.sumelectthermalfe: -1052.532080 hartree
dipole: 1.4391 0.6130 3.4148
dipole: 3.7560
quadrupole: -107.4422 -131.9934 -132.8881
quadrupole: 0.8972 1.6514 -7.2904
quadrupole: 16.6657 -7.8855 -8.7802 0.8972 1.6514 -7.2904
hfenergy: -1052.833055 hartree
pointgroup: C01 [X(C18H21N1O4)]
dipole: 0.4963318 1.2677862 0.5744641 debye
polarizability: 279.9713986|24.2410458|151.9131638|-26.4168655|12.3021961|204.4366831 unknown
InChI: InChI=1S/C18H21NO4/c1-3-22-17(20)15(18(21)23-4-2)12-11-14-10-9-13-7-5-6-8-16(13)19-14/h5-10,15H,3-4,11-12H2,1-2H3
charge 0 multiplicity 1
44 atoms
O  -0.583661 1.848492 -0.195823
O  -4.396427 0.220662 -0.585054
O  -1.47627 0.226992 -1.614479
O  -3.613101 -1.615201 0.6213
N  1.211944 -1.102738 0.254695
C  -1.656458 0.087896 1.968473
C  -2.395505 0.551847 0.679663
C  -0.698056 -1.132498 1.805201
C  0.736609 -0.758307 1.470279
C  -1.461862 0.815213 -0.513979
C  -3.499493 -0.422781 0.25984
C  1.54977 -0.072541 2.445068
C  2.527121 -0.776816 -0.063799
C  3.407066 -0.088895 0.858774
C  2.868835 0.255455 2.143172
C  3.019756 -1.139201 -1.358015
C  4.748745 0.21036 0.458735
C  0.426635 2.193443 -1.247387
C  -5.486375 -0.618722 -1.174701
C  4.334084 -0.832802 -1.723959
C  5.204576 -0.154572 -0.811274
C  1.38325 3.203805 -0.623949
C  -6.708058 -0.648702 -0.252191
H  -2.437058 -0.16922 2.707856
H  -1.09792 0.95361 2.368958
H  -2.883995 1.52149 0.897091
H  -1.08272 -1.820028 1.035645
H  -0.698149 -1.687992 2.763324
H  1.11868 0.175725 3.421139
H  3.503953 0.768536 2.875384
H  2.333884 -1.658952 -2.034254
H  5.413701 0.727961 1.16128
H  0.931178 1.261387 -1.554985
H  -0.116463 2.602011 -2.119088
H  -5.70085 -0.123082 -2.134659
H  -5.087075 -1.632684 -1.350179
H  4.70611 -1.11379 -2.715447
H  6.232007 0.075132 -1.114522
H  2.149863 3.495539 -1.364884
H  0.847019 4.112751 -0.300919
H  1.896003 2.767002 0.249906
H  -7.531682 -1.199093 -0.74401
H  -6.470544 -1.15999 0.695641
H  -7.060863 0.373594 -0.031164
