program: Gaussian 09
title: 000264293
version: EM64L-G09RevD.01
frameworkgroup: C1[X(C8H9N5O3)]
method: RPBEPBE
basis: SDD
operation: Freq
keyword: #pfreq=noraman
keyword: PBEPBE/SDD
title: #p freq=noraman PBEPBE/SDD
converged: YES YES NO NO
title: Mulliken charges:
elementType: O O O N N N N N C C C C C C C C H H H H H H H H H
charge: -0.232420 -0.216454 -0.168916 -0.130776 -0.105679 0.014147 -0.066228 0.003042 0.285944 0.085220 -0.403415 -0.642901 0.189311 -0.352454 -0.123086 -0.498544 0.272543 0.309712 0.260351 0.283567 0.245945 0.255018 0.243388 0.248370 0.244314
chargesum: 0.00000
title: Mulliken charges with hydrogens summed into heavy atoms:
elementType: O O O N N N N N C C C C C C C C
charge: -0.232420 -0.216454 -0.168916 -0.130776 -0.105679 0.014147 -0.066228 0.003042 0.285944 0.085220 0.178840 0.146963 0.189311 -0.097436 -0.123086 0.237527
polarizability: 1.88045363e+02 3.16448791e+00 1.40401945e+02 -5.18296455e+00 1.29578191e+00 8.76763670e+01
1716.lowfreq: -6.9350 -3.3696 0.0009 0.0010 0.0011 8.5198 28.7821 45.4213 51.9172
frequency: 28.7596 45.3905 51.9095 98.8908 107.4344 124.9685 136.8067 165.7174 180.1860 213.4785 226.1891 237.2039 284.2589 300.1798 321.5109 338.4417 350.5612 407.2851 424.0826 469.8063 530.8049 574.7409 610.5655 630.6633 656.9649 689.4944 730.0444 776.6126 812.1218 838.9266 906.9478 928.3207 946.6364 992.0068 1031.6441 1060.3829 1111.3304 1113.0871 1130.0861 1140.5437 1194.3861 1234.8304 1241.0233 1271.2575 1298.4048 1341.2301 1348.0358 1357.2195 1393.0000 1414.3752 1433.3369 1438.8717 1451.2626 1458.7222 1469.5646 1477.9624 1482.2301 1502.3994 1556.0603 2199.4158 2987.0342 3001.2216 3013.6487 3076.1808 3081.5885 3102.5840 3121.7598 3157.7949 3168.2169
redmass: 7.4606 7.2860 5.6725 7.6381 1.9731 4.5010 1.5553 4.8782 6.4399 5.7603 5.0867 1.1938 4.0055 4.9224 4.7473 7.2054 2.6381 3.5412 6.1678 5.8686 5.4282 6.8409 6.5646 6.8544 11.4671 10.1555 9.6551 11.2253 8.8942 7.0122 6.1508 2.6339 1.4531 3.1241 8.7353 2.8585 1.2505 1.3920 2.8481 1.4154 6.5231 3.2099 1.9205 4.9530 2.8059 3.7939 1.7942 2.2109 1.5821 1.2839 1.5246 1.3667 1.0532 1.0716 1.1593 3.6116 1.1959 2.4439 4.9392 12.4179 1.0350 1.0613 1.0287 1.0988 1.1007 1.1019 1.1051 1.1058 1.0928
irintensity: 4.2490 2.9190 2.7367 6.1328 3.3365 0.5103 1.3797 2.9313 4.7303 4.3265 4.5252 0.4605 13.3908 5.3088 1.5969 1.5909 3.0815 6.6729 2.8739 0.9843 7.6176 1.5602 3.3004 18.1913 2.9748 2.3443 9.6962 16.3854 32.6499 19.3479 13.0519 18.8341 11.7740 9.7529 3.5523 178.6998 0.1259 2.0492 28.9454 11.3286 195.8747 49.9175 118.0472 48.6329 24.4729 47.1255 50.7102 19.6337 115.9385 32.1367 32.0612 37.8349 15.2228 49.1978 10.9068 221.0667 10.3400 66.6839 708.0558 1.6386 18.0481 32.7183 37.6564 16.2373 7.1386 9.9888 20.0564 14.0975 13.9771
temp: 298.150 k
press: 1.00000 atm
elementType: 8 8 8 7 7 7 7 7 6 6 6 6 6 6 6 6 1 1 1 1 1 1 1 1 1
symmnumber: 1
zpe: 466535.3 jmol-1
zpe.correction: 0.177694 hartree
zpe.thermalcorrener: 0.193245 hartree
zpe.thermalcorrenthalpy: 0.194189 hartree
zpe.thermalcorrgfe: 0.133661 hartree
zpe.sumelectzpe: -808.365503 hartree
zpe.sumelectthermal: -808.349952 hartree
zpe.sumelectthermalent: -808.349008 hartree
zpe.sumelectthermalfe: -808.409536 hartree
dipole: -1.1723 -1.5734 -1.9952
dipole: 2.7983
quadrupole: -91.6661 -99.3611 -95.7930
quadrupole: 16.8965 -11.2618 4.0602
quadrupole: 3.9406 -3.7544 -0.1863 16.8965 -11.2618 4.0602
hfenergy: -808.5431969 hartree
pointgroup: C01 [X(C8H9N5O3)]
dipole: 0.4159738 0.3571227 -0.9547369 debye
dipolederiv: -1.763295 -0.2330117 -0.0483735 0.1952977 -0.2623486 0.0073756 -0.2459636 -0.0451464 -0.2788606 -0.2414954 -0.1407958 -0.1380199 -0.0412036 -0.7981026 -0.1292897 -0.1594611 -0.1312859 -0.4812563 -0.3893622 0.166 -0.244422 0.154567 -0.5170754 0.1423 -0.319715 0.1131339 -0.5717662 -1.3008971 -0.2352727 0.2410844 -0.3616182 -0.4632464 0.0423647 0.0411993 0.1250101 -0.3561997 -0.9127992 -0.112796 0.0398602 -0.5819118 -0.6979343 0.2768569 0.3393655 0.2742885 -0.3601736 0.3667326 -0.135942 0.4836914 -0.2196577 1.4233816 -0.0453252 0.5716381 -0.080051 0.8900992 -1.0212676 0.0151606 -0.059821 0.487418 -0.7146851 0.2482423 -0.3536714 0.2282559 -0.3256594 -0.2654409 -0.0009869 -0.0133909 0.0439159 -0.1973472 0.0256073 0.1024145 0.0087499 -0.1933 1.6987921 0.3425502 -0.2709436 0.6006748 0.4567481 -0.2028037 -0.2672609 -0.2807767 0.2992144 -0.935525 -0.1808733 0.015643 0.0502736 -0.5419485 0.1448898 -0.1866556 0.1517415 -0.1636528 0.8117665 -0.1018816 0.0574857 -0.4153622 0.2774828 0.1042 0.2826017 0.0823812 0.1906494 0.0242326 0.0003042 -0.0422017 0.0579715 0.3754852 -0.0876348 -0.1487311 -0.1231417 0.215974 1.7761715 0.3200324 0.0262623 -0.4311686 0.6387395 -0.2108479 0.3041961 -0.0042345 0.2791867 1.1857532 0.0298206 0.0827011 0.1356709 0.567613 -0.3015005 0.0979629 -0.2938167 0.1610728 -0.1018865 -0.025891 -0.081266 0.026366 -0.047508 0.0034689 -0.1277412 0.0015193 -0.0319026 0.863175 0.1546293 -0.0038754 0.2869279 0.2999899 0.0061593 -0.0414905 -0.0142564 0.2633066 -0.0948348 -0.0134012 -0.0147301 -0.032212 0.000109 -0.0973578 -0.0189885 -0.0400929 0.1051653 0.2223064 0.033072 0.0439956 0.1479736 0.0727688 0.0254838 -0.0062896 0.0087696 0.0959103 0.0082868 0.0174164 -0.1364541 -0.0247244 0.0429408 -0.0111421 -0.0395996 0.0024774 0.0215989 0.0994828 0.0735716 0.0091415 -0.0117088 -0.0582516 -0.0003872 0.0397703 -0.0756028 0.0346294 -0.0734886 -0.024785 0.0931147 0.0299287 0.1033623 0.0023827 0.1112015 0.021402 0.0812526 0.0776775 0.0094514 -0.0117204 0.0089018 -0.0258196 0.0794206 -0.0147952 0.0736596 0.0844128 -0.0684861 0.0365003 -0.0345727 0.1102029 0.0485953 0.045926 -0.0689332 0.0374753 0.1017628 0.0187937 0.0225719 0.0349176 -0.1015642 -0.0506494 -0.0903615 0.0393266 -0.0762781 0.0347248 0.0156077 -0.0154436 -0.0281064 -0.1149587 0.0677005 0.0219726 0.0696201 0.0358187 -0.0961889 unknown
polarizability: 188.2330883|3.6000493|135.010106|-0.7168584|-16.1997846|92.8804816 unknown
InChI: InChI=1S/C8H9N5O3/c1-12(4-3-9)7-6(13(14)15)8(16-2)11-5-10-7/h5H,4H2,1-2H3
charge 0 multiplicity 1
25 atoms
O  3.175572 0.063888 0.351424
O  0.532629 -2.67222 -0.212061
O  1.794635 -2.033667 1.585791
N  -1.672153 -0.501323 0.13993
N  -0.585788 1.36505 -0.769953
N  1.066195 -1.767606 0.556595
N  1.794202 1.755019 -0.529195
N  -4.462978 1.26865 1.355162
C  -0.480237 0.134351 -0.145481
C  0.822057 -0.36893 0.192917
C  -2.921972 0.030453 -0.445835
C  -1.809381 -1.637765 1.069592
C  1.93171 0.516242 0.017782
C  0.536303 2.09249 -0.93481
C  -3.772612 0.720415 0.551918
C  4.325025 0.965598 0.083515
H  -3.499534 -0.802227 -0.890323
H  -2.651867 0.750779 -1.236159
H  -1.069598 -1.56176 1.884004
H  -1.666524 -2.60719 0.558592
H  -2.812314 -1.597606 1.525803
H  0.428045 3.055662 -1.441709
H  5.19401 0.389887 0.430121
H  4.210846 1.904201 0.648787
H  4.391526 1.19141 -0.993111
