program: Gaussian 09
title: 000023063
version: EM64L-G09RevD.01
frameworkgroup: C1[X(C8H4BrF3N2)]
method: RPBEPBE
basis: SDD
operation: Freq
keyword: #p
keyword: freq=noraman
keyword: PBEPBE/SDD
title: #p freq=noraman PBEPBE/SDD
converged: NO NO NO NO
title: Mulliken charges:
elementType: Br F F F N N C C C C C C C C H H H H
charge: 0.047751 -0.114283 -0.158520 -0.158637 -0.428388 -0.003275 0.323335 0.200603 0.118481 -0.363354 -0.385098 0.258980 -0.195401 -0.217615 0.339082 0.246696 0.238144 0.251499
chargesum: 0.00000
title: Mulliken charges with hydrogens summed into heavy atoms:
elementType: Br F F F N N C C C C C C C C
charge: 0.047751 -0.114283 -0.158520 -0.158637 -0.089306 -0.003275 0.323335 0.200603 0.118481 -0.116658 -0.385098 0.258980 0.042743 0.033884
polarizability: 1.59794931e+02 -1.83199736e+00 1.41388193e+02 -7.24229728e-03 1.69228382e-03 5.01529953e+01
1716.lowfreq: -23.4268 -2.0465 -0.0010 -0.0007 -0.0004 10.1470 10.3216 80.2196 87.7524
frequency: -23.3463 80.2159 87.7513 128.2989 169.1395 219.4519 259.9977 281.6592 312.0172 339.2301 362.3672 453.2179 479.8366 533.5867 554.8074 574.3063 575.8318 620.1050 623.8841 665.2391 702.2631 757.5159 798.1465 833.6703 887.7273 900.1471 929.6209 965.6871 968.9897 1034.9186 1052.6347 1099.0820 1148.6242 1183.4623 1239.3378 1243.5769 1305.6074 1356.6978 1407.1974 1414.2357 1470.0088 1523.7529 1575.8545 1625.8349 3146.7121 3164.8297 3178.5142 3584.9408
redmass: 16.0882 8.5349 21.3192 6.5337 12.7807 8.4424 4.1841 10.4284 12.8835 10.9796 10.1270 8.9484 9.7047 4.9596 8.2427 3.3307 9.2537 6.6143 1.2756 12.2880 9.4839 1.6347 3.3266 6.5101 1.3758 9.7081 8.1478 3.7094 1.7714 5.6433 2.5561 5.3323 1.6035 2.2152 1.8805 2.0244 4.1497 4.0581 2.3228 7.8347 3.7122 5.2501 7.3276 8.1093 1.0870 1.0938 1.0982 1.0820
irintensity: 0.8576 0.0031 0.2016 7.2895 3.7111 6.9662 1.4415 3.7584 2.0543 2.8408 2.3200 6.5764 0.0786 0.5327 1.1545 2.9323 21.4124 4.2534 70.2549 8.4303 0.0781 74.0986 28.6082 1.3372 0.0467 48.4738 95.0208 182.3465 95.3639 143.6873 43.0020 152.1547 16.9600 37.8243 123.4207 71.3602 134.8939 53.4637 23.7286 19.2632 35.7361 55.7983 53.4666 11.6689 2.3049 6.4932 8.1162 88.9450
temp: 298.150 k
press: 1.00000 atm
elementType: 35 9 9 9 7 7 6 6 6 6 6 6 6 6 1 1 1 1
symmnumber: 1
zpe: 286030.3 jmol-1
zpe.correction: 0.108943 hartree
zpe.thermalcorrener: 0.119632 hartree
zpe.thermalcorrenthalpy: 0.120576 hartree
zpe.thermalcorrgfe: 0.070989 hartree
zpe.sumelectzpe: -728.755757 hartree
zpe.sumelectthermal: -728.745068 hartree
zpe.sumelectthermalent: -728.744124 hartree
zpe.sumelectthermalfe: -728.793710 hartree
dipole: 0.9661 5.8608 0.0002
dipole: 5.9398
quadrupole: -88.4753 -76.8576 -91.7596
quadrupole: -3.7458 -0.0028 0.0000
quadrupole: -2.7778 8.8399 -6.0621 -3.7458 -0.0028 0.0000
hfenergy: -728.8646998 hartree
pointgroup: C01 [X(C8H4Br1F3N2)]
dipole: -1.1188854 2.0516503 -0.0015899 debye
dipolederiv: -0.0385458 -0.0965643 0.0000865 -0.1809865 -0.6442063 0.0001806 -0.0001168 -0.0002149 0.0052266 -0.5158181 0.1926621 -0.0004231 0.2259253 -0.6653102 0.0007362 -0.0003469 0.0006972 -0.2578091 -0.7706395 -0.0985263 0.1939512 -0.2068791 -0.3804606 0.2032699 0.2654075 0.1758476 -0.6356838 -0.7695886 -0.0987056 -0.1938535 -0.2071766 -0.3814185 -0.2040066 -0.2647109 -0.1764353 -0.6350649 -0.4409841 0.0277631 -0.0001016 -0.2669584 -0.5328664 0.0000496 0.000243 0.0004583 -0.2336927 -0.1423626 -0.1937829 0.0000753 0.0577872 -0.3212262 0.0001779 -0.000146 0.0000068 -0.210491 0.3606094 0.059201 0.0000366 0.143029 0.0080478 0.0001015 0.0000378 -0.000036 0.0830791 0.0451157 0.0360984 -0.0000479 -0.1901329 -0.4092335 0.0000655 0.0000473 0.0000639 0.0653319 -0.6136272 -0.0381407 -0.0001358 0.1258453 0.670888 -0.0003284 -0.0009347 -0.000593 -0.0569239 -0.0799177 -0.1114538 0.0001156 -0.0348091 -0.0056801 -0.000118 0.0000313 -0.0002006 -0.1876112 0.2714998 0.0825195 0.000146 0.3656505 1.2886632 -0.0004028 0.0003328 0.0001379 -0.1262168 2.5118313 0.0155696 0.0005195 0.0212212 1.3902393 -0.0000394 0.0004895 -0.0000144 1.5704099 0.0038819 0.0930374 0.0000345 -0.0917332 0.2367314 -0.0001864 0.000192 0.0000365 -0.1392211 -0.0679826 0.0963973 -0.0000087 0.1805296 -0.4944763 0.0002873 -0.0000688 0.0000934 -0.1110313 0.2288268 0.0398413 -0.0001052 0.0446851 0.2293918 0.0000401 -0.0001361 0.0000255 0.3546109 0.0757604 -0.0393469 -0.0000354 -0.0041082 -0.0678204 0.0000871 -0.0000882 0.0000444 0.1871515 -0.0312311 0.0888918 -0.0001251 0.0768831 0.0042356 0.0000952 -0.0001303 0.0001102 0.1631947 -0.026828 -0.0554609 -0.000129 -0.0587723 0.0745015 -0.0000092 -0.0001025 -0.0000274 0.1647413 unknown
polarizability: 156.654772|7.1621022|144.5283071|0.0522324|-0.0402761|50.1530408 unknown
InChI: InChI=1S/C8H4BrF3N2/c9-4-2-1-3-5-6(4)14-7(13-5)8(10,11)12/h1-3,13H
charge 0 multiplicity 1
18 atoms
Br -2.442953 -2.86083 -0.000109
F  3.160946 -1.432465 0.003943
F  3.294455 0.537777 -1.130216
F  3.293639 0.540752 1.132678
N  0.622198 1.275406 -0.000382
N  0.35712 -1.001141 0.000331
C  -0.760725 1.059212 -0.000895
C  -0.903834 -0.376429 -0.000352
C  1.22965 0.014611 0.000669
C  -1.861444 1.941147 -0.001765
C  -2.206745 -0.931963 -0.000686
C  2.718342 -0.112004 0.001743
C  -3.137456 1.34603 -0.002088
C  -3.315924 -0.069849 -0.001572
H  1.099882 2.176513 -0.000364
H  -1.742461 3.028528 -0.002216
H  -4.029112 1.981618 -0.002802
H  -4.326978 -0.48671 -0.001915
