program: Gaussian 09
title: 000264274
version: EM64L-G09RevD.01
frameworkgroup: C1[X(C14H20O2)]
method: RPBEPBE
basis: SDD
operation: Freq
keyword: #pfreq=noraman
keyword: PBEPBE/SDD
title: #p freq=noraman PBEPBE/SDD
converged: YES YES NO NO
title: Mulliken charges:
elementType: O O C C C C C C C C C C C C C C H H H H H H H H H H H H H H H H H H H H
charge: -0.181537 -0.203472 -0.385403 -0.367947 -0.373019 -0.396775 -0.352754 -0.535825 -0.356889 0.447184 -0.695821 0.008911 -0.511772 0.172034 -0.260563 -0.280127 0.197389 0.194024 0.200447 0.193089 0.189887 0.191789 0.208736 0.236035 0.188128 0.189072 0.216699 0.237780 0.194831 0.195487 0.215654 0.209714 0.210165 0.274503 0.263575 0.266771
chargesum: 0.00000
title: Mulliken charges with hydrogens summed into heavy atoms:
elementType: O O C C C C C C C C C C C C C C
charge: -0.181537 -0.203472 0.006010 0.025589 0.008657 0.047996 0.024446 -0.081346 0.033429 0.447184 -0.060288 0.008911 -0.237269 0.172034 0.003012 -0.013355
polarizability: 2.16030029e+02 2.75029978e+01 1.57510589e+02 1.66450631e+01 1.06154899e+00 1.11634681e+02
1716.lowfreq: -23.6407 -0.0006 -0.0005 0.0004 3.1769 4.7160 16.3241 22.5777 34.0713
frequency: -1.9978 21.6736 34.0707 50.6364 81.0143 81.9526 92.8790 105.8384 136.5959 141.7392 165.4469 174.6370 237.1155 250.3942 279.1756 293.4788 323.6795 384.1562 412.9263 438.4588 449.7800 477.3780 495.3845 575.6294 624.0077 692.4365 719.1912 725.8760 736.3810 755.4537 785.0498 791.3165 839.6666 856.3360 882.8781 890.3826 918.6452 936.1578 982.0401 997.6017 1003.7114 1010.0136 1035.7414 1053.8300 1062.4285 1077.4011 1080.2220 1110.2177 1117.9532 1147.6210 1185.8465 1213.9296 1215.4034 1224.7481 1256.2762 1256.7677 1279.2000 1281.6331 1287.4859 1293.2200 1293.8535 1296.8936 1319.3196 1339.8591 1343.9190 1353.4252 1354.2392 1362.8615 1390.5761 1453.5225 1459.9124 1460.8955 1464.2129 1469.4083 1476.5028 1478.7924 1483.0402 1487.4559 1524.6996 1557.0768 1598.0990 1645.6156 2950.5726 2952.0149 2954.6474 2961.2192 2967.7156 2972.1390 2978.1929 2984.9066 2992.8118 2994.4233 3005.3513 3021.2299 3034.9592 3043.1435 3066.4077 3068.8969 3070.5655 3139.3231 3142.2739 3168.2407
redmass: 1.7074 4.6062 4.1216 3.7104 3.9337 1.7870 3.5891 3.8712 1.8417 2.1575 3.8791 5.1570 1.1163 4.4756 3.1013 3.2227 3.7099 5.4541 5.3185 3.4983 5.4256 3.4654 3.8695 3.9087 3.4430 4.9450 1.0619 1.1110 1.6104 1.6398 2.5892 1.3577 2.2481 1.4108 2.7822 1.9557 1.6020 1.2989 4.2166 1.3095 1.4337 2.6563 3.1176 2.9096 1.9685 2.3570 2.2368 1.3241 2.4740 2.0162 1.7463 1.3577 1.3816 1.5365 1.3589 1.3096 1.3068 1.0580 1.6713 1.2711 1.2807 1.1428 1.3477 1.4455 1.8143 1.5721 1.6695 2.6063 1.2168 1.1185 1.0745 1.0744 1.0690 1.0830 1.0825 1.0422 1.0873 1.0893 10.8847 8.4410 8.0224 7.1155 1.0589 1.0588 1.0592 1.0591 1.0585 1.0367 1.0615 1.0963 1.0857 1.0708 1.1010 1.1031 1.1032 1.1035 1.1048 1.1007 1.0993 1.0929 1.0869 1.1011
irintensity: 0.0127 0.0362 0.0152 0.0702 2.4387 0.8491 4.8564 3.8344 0.0083 0.1210 0.2145 0.7910 0.0018 0.1026 0.2782 0.2009 0.8854 18.3970 8.9394 1.8070 0.6389 0.7923 0.5910 0.3842 1.6748 2.1838 14.1807 0.3327 1.1152 4.4596 1.7295 0.4226 26.5163 5.3586 6.2136 6.7665 39.7420 3.6179 3.4827 0.1248 2.2471 1.8086 7.6912 2.8286 57.1865 0.8532 1.0209 16.2599 23.6672 5.3274 0.2112 6.8303 15.0480 1.6317 4.4857 0.5612 4.4771 6.0697 64.3672 4.4954 9.4813 4.9917 4.0002 0.6215 14.4589 0.5784 1.0864 7.0102 11.0741 4.2742 0.0654 0.2933 0.4054 1.9434 2.1976 12.3266 5.0404 27.5678 2.4110 261.9081 74.5344 17.4619 0.1480 2.3162 0.3070 28.5549 134.5951 35.8446 29.8102 1.1239 7.9259 32.0590 2.5556 0.4316 46.0307 74.4421 37.6857 103.0513 55.4618 6.3859 0.7376 8.4167
temp: 298.150 k
press: 1.00000 atm
elementType: 8 8 6 6 6 6 6 6 6 6 6 6 6 6 6 6 1 1 1 1 1 1 1 1 1 1 1 1 1 1 1 1 1 1 1 1
symmnumber: 1
zpe: 802181.8 jmol-1
zpe.correction: 0.305535 hartree
zpe.thermalcorrener: 0.322401 hartree
zpe.thermalcorrenthalpy: 0.323345 hartree
zpe.thermalcorrgfe: 0.258710 hartree
zpe.sumelectzpe: -694.680396 hartree
zpe.sumelectthermal: -694.663531 hartree
zpe.sumelectthermalent: -694.662586 hartree
zpe.sumelectthermalfe: -694.727221 hartree
dipole: 1.3951 0.3175 0.1918
dipole: 1.4436
quadrupole: -104.8323 -106.6792 -96.7363
quadrupole: -12.5873 1.7612 -4.1610
quadrupole: -2.0830 -3.9300 6.0130 -12.5873 1.7612 -4.1610
hfenergy: -694.9859312 hartree
pointgroup: C01 [X(C14H20O2)]
dipole: -0.5486054 -0.1391555 0.0472723 debye
polarizability: 215.910305|30.2985372|156.6632342|-10.6093581|7.3876957|112.6017592 unknown
InChI: InChI=1S/C14H20O2/c1-2-3-4-5-6-7-8-12-11-13(15)9-10-14(12)16/h9-11H,2-8H2,1H3
charge 0 multiplicity 1
36 atoms
O  2.018545 -2.325732 -0.184196
O  5.107324 2.164453 -0.090165
C  -2.816914 0.140972 -0.174957
C  -1.657707 -0.014887 0.835257
C  -4.21318 0.032571 0.478892
C  -0.267344 0.070984 0.16878
C  -5.372939 0.187612 -0.530821
C  0.888638 -0.078481 1.203991
C  -6.770545 0.070244 0.119237
C  2.250146 -0.028934 0.55345
C  -7.922455 0.223508 -0.897733
C  2.723229 -1.265134 -0.166802
C  3.060575 1.080334 0.567259
C  4.376621 1.119704 -0.113082
C  4.042876 -1.226629 -0.854218
C  4.825195 -0.107631 -0.831414
H  -2.721112 -0.634212 -0.963365
H  -2.727718 1.120888 -0.688899
H  -1.752986 -0.99072 1.354956
H  -1.744542 0.767827 1.617861
H  -4.310185 0.805654 1.269849
H  -4.302489 -0.94865 0.990487
H  -0.162659 1.040898 -0.357655
H  -0.173383 -0.726683 -0.592395
H  -5.288295 1.170738 -1.039871
H  -5.273899 -0.582279 -1.324543
H  0.803294 0.723106 1.961316
H  0.761251 -1.052103 1.71401
H  -6.869703 0.840015 0.911764
H  -6.853774 -0.911833 0.628237
H  -8.910229 0.135574 -0.408891
H  -7.879754 1.208942 -1.399194
H  -7.863027 -0.554153 -1.682543
H  2.763662 1.999086 1.087177
H  4.341837 -2.147017 -1.368372
H  5.801044 -0.053935 -1.327006
