program: Gaussian 09
title: 000264271
version: EM64L-G09RevD.01
frameworkgroup: C1[X(C11H14O2)]
method: RPBEPBE
basis: SDD
operation: Freq
keyword: #pfreq=noraman
keyword: PBEPBE/SDD
title: #p freq=noraman PBEPBE/SDD
converged: NO YES NO NO
title: Mulliken charges:
elementType: O O C C C C C C C C C C C H H H H H H H H H H H H H H
charge: -0.181159 -0.201854 -0.188265 -0.036714 0.432800 -0.742962 -0.708678 -0.725100 -0.015890 -0.492975 0.153642 -0.252414 -0.282662 0.257665 0.200670 0.208194 0.234406 0.227959 0.214677 0.218398 0.222007 0.225677 0.215166 0.216781 0.269895 0.264301 0.266435
chargesum: 0.00000
title: Mulliken charges with hydrogens summed into heavy atoms:
elementType: O O C C C C C C C C C C C
charge: -0.181159 -0.201854 0.069400 0.163956 0.432800 -0.072403 -0.053596 -0.067475 -0.015890 -0.223079 0.153642 0.011887 -0.016227
polarizability: 1.52468150e+02 1.80936967e+01 1.33249520e+02 1.06066640e+01 6.65376003e+00 8.64909186e+01
1716.lowfreq: -12.7173 -0.0006 -0.0003 0.0007 9.7485 14.1650 24.4774 59.1686 75.5585
frequency: 23.7953 59.1473 75.4740 95.8235 168.1318 183.5289 197.9377 219.5780 228.4823 258.0894 283.2315 323.3435 365.3215 378.9569 407.9437 438.0322 455.2685 466.2812 535.4061 569.6061 626.1148 691.3843 761.4079 785.0310 789.4206 847.5163 869.6025 910.1008 916.3494 921.9920 953.8525 978.0951 998.7718 1001.4638 1070.1236 1077.1818 1123.7956 1133.3655 1166.7177 1173.7350 1216.4886 1258.3362 1291.5903 1300.4205 1312.0210 1329.9461 1350.3083 1372.2456 1378.8237 1390.9002 1396.4672 1464.0076 1467.9649 1476.1230 1478.7742 1483.0311 1496.2931 1523.3904 1554.2884 1597.2329 1643.8292 2953.4080 2973.4581 2976.6703 2982.7072 3005.0660 3063.9877 3071.3366 3074.4989 3076.5927 3081.8084 3093.2061 3138.2676 3142.3172 3168.4389
redmass: 3.8817 2.6828 4.1689 7.2382 3.0607 2.0637 1.2208 1.2745 1.4061 3.6542 3.6332 2.0724 2.3107 2.4510 7.7022 3.3706 6.5648 3.1616 4.0816 4.6446 3.0478 4.1886 4.3078 2.7331 2.2812 2.3991 3.0689 2.1821 1.1975 1.5946 1.3981 1.3274 1.3030 2.1532 1.6593 2.8114 2.0783 1.7423 1.9942 2.0206 1.7471 2.0085 1.5115 1.7836 1.5425 1.2666 1.8500 1.8220 1.2545 1.2183 1.2026 1.0533 1.0452 1.0576 1.0486 1.0506 1.0485 10.2936 8.8520 7.6899 6.9557 1.0827 1.0359 1.0362 1.0375 1.0833 1.0994 1.0995 1.0994 1.0987 1.0990 1.0984 1.0921 1.0869 1.1012
irintensity: 0.2259 0.0086 3.4336 8.3926 0.2521 0.6382 0.1844 0.0698 0.0305 1.0148 0.7594 0.2835 0.0284 0.3695 24.0333 0.2013 1.2317 1.9280 1.2972 0.2489 1.8867 2.1012 5.5869 1.3144 1.7274 25.1587 6.5071 2.7752 3.0614 45.7421 0.1451 7.5479 0.1592 40.2667 5.1345 26.2640 10.2634 14.6132 3.4516 11.4563 2.7757 12.5350 13.2112 62.1960 17.8384 9.0864 3.6499 24.1938 8.9148 23.6051 9.0207 6.0645 6.5460 4.0442 21.1645 20.4485 2.8076 5.2526 244.7344 62.9550 8.4629 14.8624 32.1895 23.6936 22.0417 7.2784 10.3250 35.1819 25.4086 62.0784 49.5999 28.1291 7.0109 0.7043 8.5175
temp: 298.150 k
press: 1.00000 atm
elementType: 8 8 6 6 6 6 6 6 6 6 6 6 6 1 1 1 1 1 1 1 1 1 1 1 1 1 1
symmnumber: 1
zpe: 580868.6 jmol-1
zpe.correction: 0.221241 hartree
zpe.thermalcorrener: 0.234814 hartree
zpe.thermalcorrenthalpy: 0.235758 hartree
zpe.thermalcorrgfe: 0.180575 hartree
zpe.sumelectzpe: -577.010071 hartree
zpe.sumelectthermal: -576.996498 hartree
zpe.sumelectthermalent: -576.995554 hartree
zpe.sumelectthermalfe: -577.050737 hartree
dipole: 1.2636 0.2355 0.0824
dipole: 1.2880
quadrupole: -76.7313 -88.4204 -78.3728
quadrupole: -12.1641 -1.3876 -3.6354
quadrupole: 4.4436 -7.2456 2.8020 -12.1641 -1.3876 -3.6354
hfenergy: -577.2313124 hartree
pointgroup: C01[X(C11H14O2)]
dipole: -0.4968901 0.0992326 -0.0044175 debye
polarizability: 152.4044806|-20.3025787|133.4209706|5.1189142|6.4744939|86.3831363 unknown
InChI: InChI=1S/C11H14O2/c1-7(2)8(3)10-6-9(12)4-5-11(10)13/h4-8H,1-3H3
charge 0 multiplicity 1
27 atoms
O  0.020902 2.494189 0.050316
O  2.88565 -2.140367 -0.04663
C  -1.490706 0.115165 -0.627576
C  -2.308747 -0.565603 0.530614
C  0.000373 0.095391 -0.317104
C  -1.768301 -0.527173 -2.013235
C  -2.035957 0.123759 1.889973
C  -3.826212 -0.561088 0.231909
C  0.672726 1.400528 0.024614
C  0.759952 -1.049586 -0.333974
C  2.208019 -1.060119 -0.024382
C  2.128638 1.392806 0.338014
C  2.856743 0.238277 0.314675
H  -1.79957 1.178471 -0.661813
H  -1.969536 -1.622225 0.598644
H  -1.595395 -1.619824 -1.997715
H  -2.812781 -0.354169 -2.322591
H  -1.113113 -0.090619 -2.788079
H  -2.629532 -0.35127 2.692304
H  -0.971355 0.06247 2.180266
H  -2.313708 1.193838 1.847618
H  -4.081114 -1.155376 -0.662655
H  -4.192366 0.472018 0.075703
H  -4.384146 -0.988197 1.085628
H  0.324282 -2.024682 -0.582253
H  2.5695 2.365783 0.582424
H  3.928751 0.205705 0.539299
