program: Gaussian 09
title: 000264270
version: EM64L-G09RevD.01
frameworkgroup: C1[X(C10H14O2)]
method: RPBEPBE
basis: SDD
operation: Freq
keyword: #pfreq=noraman
keyword: PBEPBE/SDD
title: #p freq=noraman PBEPBE/SDD
converged: YES YES NO NO
title: Mulliken charges:
elementType: O O C C C C C C C C C C H H H H H H H H H H H H H H
charge: -0.446120 -0.441736 -0.028525 -0.560004 0.430947 -0.692248 -0.712308 0.095720 -0.547316 0.279668 -0.356345 -0.349251 0.198273 0.198819 0.240332 0.216267 0.228363 0.201289 0.213704 0.230548 0.200866 0.230127 0.215211 0.250978 0.351737 0.351002
chargesum: 0.00000
title: Mulliken charges with hydrogens summed into heavy atoms:
elementType: O O C C C C C C C C C C
charge: -0.094383 -0.090734 0.169748 -0.120852 0.430947 -0.046329 -0.067189 0.095720 -0.317189 0.279668 -0.141134 -0.098273
polarizability: 1.36601523e+02 -3.61059161e+00 1.27884189e+02 -1.22019106e+01 -7.95619117e+00 7.62143975e+01
1716.lowfreq: -6.2788 -0.0007 -0.0005 0.0005 3.4249 13.4676 51.2877 86.2991 93.2143
frequency: 50.9561 86.2852 93.1649 145.8865 209.9219 230.2910 242.0176 248.6772 314.3434 322.6819 325.8388 355.5864 368.3581 379.0498 426.9081 439.3558 471.9458 506.4255 554.2945 635.6319 700.2408 727.5002 759.0913 786.2582 797.5714 857.5265 885.5047 913.9791 920.7763 933.6432 956.7762 967.5113 1060.3584 1093.9851 1101.2747 1133.6424 1151.6562 1175.8982 1193.1873 1218.9368 1236.6161 1269.8007 1275.7050 1316.6632 1332.7261 1351.4012 1375.4225 1396.5751 1398.9031 1429.1841 1460.9460 1465.4264 1475.1866 1480.1271 1490.1125 1507.6713 1614.2270 1624.3338 2957.1813 2966.9182 2976.8269 2986.8288 3055.9975 3061.1489 3065.4633 3071.7479 3086.0922 3108.9004 3114.8074 3175.6813 3584.9481 3586.4794
redmass: 3.2085 3.2630 3.3289 5.9248 1.2317 3.7218 2.6278 1.0409 1.2176 2.3541 1.2880 3.6410 2.7634 1.9927 3.7159 3.0977 5.4154 2.8612 3.7647 3.7972 5.5405 4.5499 3.6791 3.0701 1.5321 1.5129 1.6246 1.3412 1.3422 2.3848 1.7171 1.9494 2.1411 1.4899 1.6326 1.6520 1.2122 1.5193 1.7642 1.5664 1.6019 2.2051 1.7336 1.5175 1.5031 1.3846 1.2267 1.9364 2.0509 3.3291 1.0472 1.1009 1.0575 1.0643 1.0551 2.7965 7.0001 6.5128 1.0803 1.0365 1.0367 1.0646 1.0986 1.0991 1.0998 1.0991 1.0993 1.0909 1.0901 1.0948 1.0659 1.0661
irintensity: 0.0348 0.4467 0.0990 0.0544 0.0722 2.1247 1.5160 0.4014 114.2532 15.8611 151.9191 1.6783 1.7620 1.6930 3.2791 18.6530 3.8208 4.6002 9.7703 4.3488 11.1666 34.9858 2.7268 2.7253 43.9945 28.8878 6.8824 0.0870 1.2580 1.6473 0.2335 1.1918 38.8582 11.8935 103.8050 198.7011 116.2344 6.3613 7.4947 9.0491 9.4178 2.4903 19.9521 1.2698 1.3669 2.8096 21.4636 21.8693 29.6474 117.4757 4.1822 3.8384 0.7485 24.3723 16.7159 59.7036 12.2415 6.3822 29.9323 30.1786 38.1072 45.8856 8.9106 41.2785 6.3916 107.7435 32.7253 21.5234 11.4305 5.4237 46.0699 11.6026
temp: 298.150 k
press: 1.00000 atm
elementType: 8 8 6 6 6 6 6 6 6 6 6 6 1 1 1 1 1 1 1 1 1 1 1 1 1 1
symmnumber: 1
zpe: 568483.3 jmol-1
zpe.correction: 0.216524 hartree
zpe.thermalcorrener: 0.229087 hartree
zpe.thermalcorrenthalpy: 0.230032 hartree
zpe.thermalcorrgfe: 0.178436 hartree
zpe.sumelectzpe: -538.985910 hartree
zpe.sumelectthermal: -538.973346 hartree
zpe.sumelectthermalent: -538.972402 hartree
zpe.sumelectthermalfe: -539.023998 hartree
dipole: -0.5437 0.1671 0.2054
dipole: 0.6047
quadrupole: -78.2129 -57.9621 -75.3927
quadrupole: 3.4724 -0.3778 -5.0101
quadrupole: -7.6903 12.5605 -4.8702 3.4724 -0.3778 -5.0101
hfenergy: -539.202434 hartree
pointgroup: C01 [X(C10H14O2)]
dipole: 0.2158388 -0.0598163 0.0802272 debye
dipolederiv: -0.5519506 0.6027901 0.0397397 0.5647031 -0.8924408 0.1273395 0.0634652 0.1533155 -0.361415 -0.7282643 0.6323927 0.0545382 0.7193012 -0.8485438 0.1291709 0.0442198 0.1280457 -0.3789946 0.2394896 0.0182577 -0.0013929 0.0582605 0.1864376 -0.011069 -0.1336165 -0.0531114 0.1409893 -0.0315027 -0.0078995 0.0205273 -0.0692708 0.03457 0.0220276 0.128768 0.076192 0.0911515 0.2298621 -0.0383395 0.0392167 0.3255237 -0.0228023 0.1105928 0.1699078 0.0222557 -0.0590309 0.0438071 0.0231613 0.0293482 -0.0061479 -0.0441343 -0.0619776 0.03548 -0.0462828 -0.0295335 0.0149431 0.0125447 0.0090497 0.0191643 -0.0786818 0.0673014 0.0484596 0.0730367 0.0305835 0.247541 -0.5795785 0.0023433 -0.6502517 0.7158579 -0.1005895 -0.0607555 -0.1034752 -0.0009599 -0.1922374 0.2369586 0.0627195 -0.0482021 -0.036821 0.0107458 0.0059375 0.1033573 -0.1655396 0.5196157 -0.6124038 0.0165448 -0.7791647 0.7668906 -0.0727698 0.0016811 -0.0668683 0.0496719 0.0237634 0.2420703 0.0938524 -0.1092915 -0.0055046 0.0014577 0.0505853 0.1228633 -0.1389047 -0.069913 -0.0894629 0.0417322 0.3336871 -0.1170995 0.1028903 0.1047716 -0.0216172 -0.1354882 -0.2125378 -0.0315518 -0.119556 -0.0364359 0.014228 -0.0094017 -0.0853489 -0.00023 -0.0418147 -0.0062176 0.0137176 0.0328466 -0.0146008 -0.0353659 -0.1673197 -0.0174822 -0.1044222 -0.0694915 0.01026 0.0209327 -0.0377057 0.0536348 -0.0387026 0.109945 -0.032539 0.0544113 0.0456295 -0.0664421 -0.0156617 -0.1358751 0.0228162 0.0600428 -0.0120281 -0.124643 -0.025684 0.0101932 0.1153145 0.0410793 -0.0194598 0.0653977 -0.1267756 0.0373658 -0.04295 0.0672454 0.0537644 -0.0998718 -0.0457075 0.142329 -0.0948303 0.0638838 0.0545832 0.1541964 0.0249794 -0.0401713 -0.0811249 -0.104156 0.1225733 -0.0636174 0.0392908 0.0550141 0.1359543 0.0902164 -0.0136296 -0.0680767 0.0375802 -0.1195225 0.0024433 0.0708317 -0.0204288 -0.1357376 -0.0186753 0.0193629 0.0876138 0.0563737 0.028442 0.0379239 -0.0624177 -0.1091738 0.010911 -0.1581226 -0.073429 0.0907689 -0.0264617 -0.0447501 -0.0241058 -0.100727 -0.0566391 -0.0434804 -0.06206 0.1216509 0.0775922 -0.0082147 -0.029324 -0.0383481 -0.1241803 -0.0608647 -0.038657 -0.0586924 0.1418873 -0.0386997 -0.0154256 -0.0742831 -0.0161286 0.0996737 -0.0201897 -0.0796832 -0.0194489 0.1434539 0.1971116 -0.1893086 -0.0663042 -0.1095218 0.2471621 -0.0558377 -0.080076 -0.0918671 0.3301795 0.2491558 -0.1736868 -0.0876294 -0.1429383 0.2353282 -0.070145 -0.0793683 -0.0853611 0.3298847 unknown
polarizability: 136.9436035|-3.1234674|128.0645254|11.5880678|7.1413022|75.691981 unknown
InChI: InChI=1S/C10H14O2/c1-7(2)5-8-6-9(11)3-4-10(8)12/h3-4,6-7,11-12H,5H2,1-2H3
charge 0 multiplicity 1
26 atoms
O  0.679617 -2.441227 0.311732
O  -3.071271 1.739403 -0.195159
C  2.595141 0.669724 0.055029
C  1.541535 0.166953 1.101532
C  0.145607 -0.091977 0.556453
C  2.791347 -0.330705 -1.107599
C  2.26915 2.082241 -0.485021
C  -0.263436 -1.395206 0.162968
C  -0.805394 0.952379 0.441264
C  -2.104953 0.718393 -0.065379
C  -1.563853 -1.634434 -0.341433
C  -2.490419 -0.579443 -0.461868
H  3.553847 0.73611 0.612943
H  1.478409 0.922655 1.909732
H  1.926453 -0.766987 1.548958
H  1.871027 -0.409321 -1.715676
H  3.026969 -1.341009 -0.729972
H  3.611562 -0.000112 -1.772447
H  3.077053 2.438699 -1.151052
H  1.331122 2.07514 -1.070085
H  2.158715 2.815617 0.337003
H  -0.517282 1.961417 0.766324
H  -1.861727 -2.648325 -0.639864
H  -3.499421 -0.746848 -0.848245
H  0.276479 -3.305384 0.049872
H  -2.703578 2.606246 0.107388
