program: Gaussian 09
title: 000256198
version: EM64L-G09RevD.01
frameworkgroup: C1[X(C10H13Cl2N3)]
method: RPBEPBE
basis: SDD
operation: Freq
keyword: #p
keyword: freq=noraman
keyword: PBEPBE/SDD
title: #p freq=noraman PBEPBE/SDD
converged: YES YES NO NO
title: Mulliken charges:
elementType: Cl Cl N N N C C C C C C C C C C H H H H H H H H H H H H H
charge: -0.059272 -0.038383 -0.075989 -0.019639 -0.177548 -0.307410 -0.339059 -0.584867 -0.550223 0.192519 -0.354747 -0.305497 -0.204718 -0.203279 -0.248600 0.219214 0.277901 0.221158 0.271611 0.311554 0.255416 0.261359 0.271051 0.244559 0.262897 0.227389 0.224549 0.228054
chargesum: 0.00000
title: Mulliken charges with hydrogens summed into heavy atoms:
elementType: Cl Cl N N N C C C C C C C C C C
charge: -0.059272 -0.038383 -0.075989 -0.019639 -0.177548 0.189706 0.153711 -0.017898 -0.017813 0.192519 -0.110188 -0.042600 0.022671 0.021270 -0.020546
polarizability: 2.49550762e+02 3.10480973e+00 1.50470791e+02 1.09622633e+01 -1.80660478e+01 9.21268219e+01
1716.lowfreq: -7.5523 -5.8578 -0.0016 -0.0011 0.0015 3.6701 17.8259 22.8428 32.0524
frequency: 17.7259 22.8295 32.0334 38.6643 80.0806 84.6288 113.0642 136.9710 182.2831 227.0988 250.0591 292.5409 300.1254 337.9444 384.7015 407.8344 428.3262 493.1747 525.5227 552.4200 608.3410 614.0187 636.9890 679.4799 695.6383 757.8360 777.1687 797.5029 849.2175 895.1215 912.3047 928.8002 936.2038 980.2911 985.3439 994.0207 1003.6531 1016.7013 1023.7117 1047.4402 1078.4011 1110.9724 1121.2394 1164.3186 1169.4890 1197.5848 1207.5782 1250.7793 1267.3289 1276.6773 1307.1145 1321.5542 1343.8775 1344.8699 1370.9852 1374.2388 1388.3395 1432.8922 1442.4278 1445.3179 1447.2105 1454.7903 1471.4102 1584.5161 1605.1799 2961.5053 3020.4993 3052.3888 3066.6327 3088.1527 3089.6668 3125.5679 3133.0531 3135.2502 3150.7106 3161.2118 3162.5968 3170.6419
redmass: 8.7631 4.1441 10.6753 9.7020 3.0278 3.4417 4.3222 4.4974 5.4869 5.4307 2.9346 3.6241 6.3069 4.1059 3.5751 2.9322 3.8869 3.8277 3.2744 4.7292 6.0444 6.2425 3.9516 6.2293 1.8578 1.3228 1.7554 2.9410 1.2479 2.5097 3.0536 1.4807 1.9429 1.3734 5.8954 1.3192 1.6109 2.2512 2.3107 4.5600 1.5100 1.6663 1.3514 1.3284 1.0590 1.8539 1.6125 1.2521 1.5222 1.4535 1.3429 1.5147 1.3167 2.0000 1.6912 2.7383 5.2893 1.0792 2.0456 1.2067 1.1125 1.0940 2.2608 6.2346 6.2309 1.0685 1.0583 1.0579 1.0582 1.0953 1.1008 1.0848 1.1097 1.0886 1.0930 1.1109 1.0961 1.0998
irintensity: 1.3667 0.1423 1.1924 0.5374 0.6029 3.7838 1.3619 2.4457 2.3253 6.8564 2.8068 1.6060 2.9932 3.7725 0.1382 0.0218 5.6789 10.2089 17.7231 31.5794 7.0351 5.4445 7.9622 88.5728 48.0784 13.9057 61.3805 2.7933 0.0309 10.5629 4.5114 10.4349 13.4982 0.0579 0.0564 0.7585 33.5369 25.5432 15.4958 1.1722 16.2108 155.6624 12.6144 0.5343 0.0953 4.0046 18.7432 12.6783 6.2356 5.1432 19.1844 14.3360 33.9637 116.8291 58.8819 102.9757 43.0556 26.5807 15.5219 33.5026 4.0610 17.7097 38.3542 2.9955 6.9590 49.9917 22.8245 33.4874 17.2188 2.5230 5.6848 2.7621 17.2678 10.6176 25.9668 5.2313 23.2349 17.8770
temp: 298.150 k
press: 1.00000 atm
elementType: 17 17 7 7 7 6 6 6 6 6 6 6 6 6 6 1 1 1 1 1 1 1 1 1 1 1 1 1
symmnumber: 1
zpe: 571484.7 jmol-1
zpe.correction: 0.217667 hartree
zpe.thermalcorrener: 0.233045 hartree
zpe.thermalcorrenthalpy: 0.233989 hartree
zpe.thermalcorrgfe: 0.170481 hartree
zpe.sumelectzpe: -1472.057416 hartree
zpe.sumelectthermal: -1472.042038 hartree
zpe.sumelectthermalent: -1472.041094 hartree
zpe.sumelectthermalfe: -1472.104602 hartree
dipole: 1.6888 -1.2766 2.4454
dipole: 3.2344
quadrupole: -87.5890 -111.9176 -103.1193
quadrupole: -8.6267 6.6503 -5.4238
quadrupole: 13.2863 -11.0423 -2.2440 -8.6267 6.6503 -5.4238
hfenergy: -1472.2750829 hartree
pointgroup: C01 [X(C10H13Cl2N3)]
dipole: 0.70661 -0.6284686 0.8515046 debye
polarizability: 250.1256015|2.4996676|154.5233852|5.2332585|-8.7485033|87.4993879 unknown
InChI: InChI=1S/C10H13Cl2N3/c11-6-8-15(9-7-12)14-13-10-4-2-1-3-5-10/h1-5H,6-9H2
charge 0 multiplicity 1
28 atoms
Cl 3.285259 3.534995 0.001311
Cl 2.232459 -3.054336 -1.52256
N  1.829236 -0.338862 0.322678
N  0.474291 -0.541059 0.412842
N  -0.233149 0.487459 0.00956
C  2.41613 0.890096 -0.25377
C  2.656716 -1.459387 0.776486
C  2.405273 2.043383 0.762935
C  3.415097 -2.197717 -0.335996
C  -1.649692 0.274018 0.05667
C  -2.443877 1.409546 -0.251419
C  -2.282156 -0.963513 0.367379
C  -3.851785 1.317828 -0.239396
C  -3.688232 -1.045339 0.376348
C  -4.480796 0.090757 0.075758
H  3.450858 0.671445 -0.56916
H  1.82261 1.181487 -1.138317
H  3.414375 -1.097166 1.503909
H  1.985153 -2.156408 1.303433
H  1.381471 2.37137 0.984919
H  2.962756 1.808379 1.681845
H  4.024765 -1.526372 -0.959799
H  4.045985 -2.992257 0.09154
H  -1.936559 2.348612 -0.497216
H  -1.664735 -1.839007 0.590159
H  -4.456118 2.200187 -0.477505
H  -4.173582 -1.999286 0.613061
H  -5.573853 0.016647 0.082203
