program: Gaussian 09
title: 000256195
version: EM64L-G09RevD.01
frameworkgroup: C1[X(C14H20N4)]
method: RPBEPBE
basis: SDD
operation: Freq
keyword: #pfreq=noraman
keyword: PBEPBE/SDD
title: #p freq=noraman PBEPBE/SDD
converged: YES YES NO NO
title: Mulliken charges:
elementType: N N N N C C C C C C C C C C C C C C H H H H H H H H H H H H H H H H H H H H
charge: -0.084837 -0.224569 -0.063033 -0.107263 -0.362236 -0.359386 -0.386876 -0.392548 -0.399692 -0.367074 0.338783 -0.079722 -0.531232 0.409816 0.377319 -0.506537 -0.821077 -0.813915 0.209090 0.180277 0.181007 0.238777 0.203721 0.195215 0.198870 0.207972 0.191470 0.217337 0.234067 0.224273 0.261259 0.256966 0.233413 0.227398 0.227491 0.224297 0.224942 0.236238
chargesum: 0.00000
title: Mulliken charges with hydrogens summed into heavy atoms:
elementType: N N N N C C C C C C C C C C C C C C
charge: -0.084837 -0.224569 -0.063033 -0.107263 0.027131 0.060399 0.012059 0.014294 0.009115 0.091266 0.338783 -0.079722 -0.269974 0.409816 0.377319 -0.249571 -0.132776 -0.128437
polarizability: 2.18671318e+02 -1.48637890e+01 1.88222575e+02 1.79112528e+01 7.42510038e+00 1.25986039e+02
1716.lowfreq: -10.5026 -5.8383 -0.0006 0.0007 0.0008 12.9599 20.6965 29.2313 42.9417
frequency: 19.4578 27.5682 42.7067 103.6810 117.9636 124.8497 138.2901 185.4872 199.4906 229.6374 238.4900 287.1946 300.5816 304.7260 335.0877 355.6104 361.0705 378.6773 434.1185 439.3174 448.3263 461.3176 464.6991 554.1661 569.7930 622.1519 654.3968 710.1481 722.3610 752.2618 755.6003 804.2444 811.8980 840.2576 850.1905 857.6586 859.8143 888.2430 890.0491 924.3297 956.5827 991.1504 999.0587 1004.1022 1032.2149 1044.3036 1048.1910 1052.6757 1061.6326 1099.4288 1106.7274 1125.2298 1131.2415 1151.5710 1158.8995 1179.4459 1202.4278 1227.0326 1246.1156 1257.8183 1261.4117 1267.7794 1292.0497 1302.5062 1331.4804 1340.2975 1341.1998 1351.1194 1362.4813 1378.3189 1393.0661 1394.7227 1398.9965 1406.9086 1442.5563 1449.9296 1460.3209 1461.1515 1461.4624 1464.7080 1467.0653 1472.5268 1476.0107 1482.5824 1484.6213 1494.7297 1580.4004 1639.4406 2839.8063 2852.0029 2915.1316 2969.0813 2970.2813 2970.7769 2986.2900 2990.0462 3014.5873 3017.6049 3036.7945 3041.5414 3043.8546 3047.4691 3049.4870 3058.1580 3084.4970 3087.8272 3155.1187 3160.2604
redmass: 3.1699 3.7192 3.9398 3.2423 1.5100 2.3309 2.3684 1.2974 2.3458 3.1947 1.9428 2.9811 2.4935 2.4709 4.4141 4.7730 2.9157 1.7771 2.7793 4.3941 3.4657 3.0467 4.5407 2.1004 2.9620 7.7072 4.2874 4.8909 5.3657 4.0728 3.8852 1.5076 4.5081 3.7975 2.6029 1.4747 1.4543 1.4152 3.5249 2.7520 1.3102 2.4924 1.4233 1.5768 1.4490 1.9561 2.5137 1.6340 3.3007 1.4878 2.3585 2.4965 2.2434 1.2944 2.4820 3.5421 5.3066 1.9942 1.8836 1.4189 1.8198 1.2068 1.3249 1.4955 1.2996 1.6059 1.4919 1.4964 2.1046 1.8340 1.7237 1.7002 1.5118 1.4052 1.6846 1.0948 1.1753 1.2400 1.1483 1.4797 1.0878 1.0994 1.0469 1.1148 1.2373 2.1188 8.3325 7.6038 1.0710 1.0703 1.0656 1.0630 1.0379 1.0381 1.0619 1.0614 1.0914 1.0898 1.0959 1.0969 1.0968 1.0913 1.1009 1.1036 1.0984 1.0977 1.0926 1.0928
irintensity: 1.2364 1.3107 0.1098 2.7036 0.5391 0.5936 0.1029 0.3524 1.4572 0.3679 0.9382 1.4619 0.0711 6.2663 3.2921 3.6845 1.1376 2.9756 7.6160 1.5412 1.2921 0.2190 1.4582 0.6863 0.0669 1.5353 0.1773 16.1828 0.5198 2.4844 12.9223 0.3822 1.0609 13.2023 8.5604 9.8383 23.3295 10.5037 72.5316 26.7236 2.2218 45.2198 19.6318 1.0612 15.8697 2.0376 8.9208 0.0793 6.7580 3.7654 65.4976 5.7121 8.1278 6.8266 39.2316 1.5751 40.1234 7.3567 7.5417 3.0443 3.3879 7.7776 2.6041 13.1203 16.1893 46.8728 10.6564 2.7951 17.3138 0.3291 1.6132 8.1688 2.9155 27.2487 12.0814 7.0437 5.8777 12.9830 1.5187 14.1975 4.5418 12.0199 29.1639 7.4971 2.3081 40.6994 12.3011 10.4110 68.7958 134.1305 73.6401 43.9278 52.7617 20.5369 26.0095 26.9609 7.5539 70.7884 59.7535 39.7133 3.2362 34.1378 6.8320 96.5511 35.8175 6.0539 11.0276 3.4658
temp: 298.150 k
press: 1.00000 atm
elementType: 7 7 7 7 6 6 6 6 6 6 6 6 6 6 6 6 6 6 1 1 1 1 1 1 1 1 1 1 1 1 1 1 1 1 1 1 1 1
symmnumber: 1
zpe: 843918.9 jmol-1
zpe.correction: 0.321432 hartree
zpe.thermalcorrener: 0.338189 hartree
zpe.thermalcorrenthalpy: 0.339133 hartree
zpe.thermalcorrgfe: 0.275854 hartree
zpe.sumelectzpe: -763.113704 hartree
zpe.sumelectthermal: -763.096947 hartree
zpe.sumelectthermalent: -763.096003 hartree
zpe.sumelectthermalfe: -763.159282 hartree
dipole: -1.6770 -4.8677 -1.1309
dipole: 5.2712
quadrupole: -92.6778 -120.4395 -105.8021
quadrupole: -8.3133 2.7580 -0.8465
quadrupole: 13.6286 -14.1330 0.5044 -8.3133 2.7580 -0.8465
hfenergy: -763.4351361 hartree
pointgroup: C01 [X(C14H20N4)]
dipole: -0.3130817 -1.5699133 1.3184364 debye
polarizability: 213.3393059|19.3564707|159.1212449|28.4433794|-26.2308427|160.4193808 unknown
InChI: InChI=1S/C14H20N4/c1-11-8-13-14(9-12(11)2)18(16-15-13)10-17-6-4-3-5-7-17/h8-9H,3-7,10H2,1-2H3
charge 0 multiplicity 1
38 atoms
N  -2.10375 -0.833376 -0.570246
N  -0.218941 0.176482 -1.720828
N  -0.138402 1.329244 -2.562725
N  1.006848 1.963453 -2.281644
C  -2.929461 -2.063452 -0.475144
C  -2.873154 0.395845 -0.243019
C  -3.507902 -2.215184 0.946933
C  -3.454987 0.310412 1.181326
C  -4.319724 -0.960607 1.345797
C  -1.365788 -0.727906 -1.83772
C  0.897518 0.105352 -0.903089
C  1.678186 1.245241 -1.268382
C  1.327879 -0.794635 0.098385
C  2.567269 -0.547172 0.721568
C  3.37022 0.603012 0.353378
C  2.919803 1.495566 -0.636872
C  3.062797 -1.495657 1.798703
C  4.701983 0.847886 1.04211
H  -2.292641 -2.934511 -0.722955
H  -3.775526 -2.048438 -1.21122
H  -3.706764 0.545888 -0.977509
H  -2.197201 1.264675 -0.331329
H  -2.670226 -2.353818 1.657473
H  -4.141685 -3.121666 0.990473
H  -4.052334 1.219047 1.386851
H  -2.61869 0.288523 1.906338
H  -5.216698 -0.882488 0.696685
H  -4.682666 -1.051387 2.386824
H  -1.966312 -0.321174 -2.684271
H  -1.011139 -1.739036 -2.11493
H  0.709429 -1.645577 0.396814
H  3.513753 2.369987 -0.9206
H  2.343785 -2.313608 1.973111
H  4.033573 -1.951126 1.523444
H  3.220747 -0.972366 2.761273
H  4.582785 0.963132 2.136709
H  5.404487 0.006506 0.885926
H  5.183328 1.762833 0.658264
