program: Gaussian 09
title: 000256185
version: EM64L-G09RevD.01
frameworkgroup: C1[X(C5H9Br2OP)]
method: RPBEPBE
basis: SDD
operation: Freq
keyword: #p
keyword: freq=noraman
keyword: PBEPBE/SDD
title: #p freq=noraman PBEPBE/SDD
converged: YES YES NO NO
title: Mulliken charges:
elementType: Br Br P O C C C C C H H H H H H H H H
charge: -0.013762 0.029880 1.096823 -0.644320 -0.713832 -0.701593 -0.430634 -0.450591 -0.902982 0.293690 0.321892 0.321904 0.283370 0.356995 0.352062 0.255942 0.275200 0.269954
chargesum: 0.00000
title: Mulliken charges with hydrogens summed into heavy atoms:
elementType: Br Br P O C C C C C
charge: -0.013762 0.029880 1.096823 -0.644320 -0.098250 -0.096319 -0.073639 -0.098528 -0.101886
polarizability: 1.48274594e+02 -2.37380458e+00 1.03156701e+02 1.00029660e+01 -5.19407972e-01 8.14709089e+01
1716.lowfreq: -14.6411 -6.7565 -5.1975 -0.0014 -0.0014 -0.0011 52.8975 82.1342 125.3467
frequency: 52.8644 82.1006 125.3464 142.2365 150.3504 179.1289 195.6041 243.7340 267.6822 296.4240 325.4543 458.8251 500.4724 563.6840 578.6051 629.8629 676.2441 760.0716 831.9324 858.4717 874.2343 910.2037 943.0722 979.4035 1021.2469 1071.3432 1110.5612 1125.6007 1160.1585 1178.0054 1203.8251 1228.0093 1277.3769 1298.7388 1326.1539 1409.1969 1414.8989 1435.3865 1446.8226 3005.8871 3028.4533 3031.7408 3110.0935 3118.5997 3121.8290 3126.5497 3126.9091 3129.7596
redmass: 7.9732 6.9801 5.5311 1.8452 1.6440 16.3385 4.5304 3.7715 4.5920 2.5355 2.2955 6.1537 4.3635 3.2721 6.5378 4.3049 4.2059 3.9662 1.6756 1.9034 3.3695 1.7533 1.4268 2.1733 3.2571 1.6060 1.0781 1.0802 1.1586 1.7733 1.2485 1.4368 1.4545 1.4199 1.1685 1.0771 1.0775 1.0484 1.0481 1.0314 1.0628 1.0617 1.0877 1.0919 1.1002 1.1001 1.1015 1.1023
irintensity: 2.3466 3.4693 3.8587 3.9019 3.8026 0.5569 6.2833 10.2890 10.4422 3.5562 2.5023 4.5229 64.3544 9.1308 21.3557 10.2709 13.6398 9.7841 6.8592 67.1639 3.2277 2.9422 37.1244 19.7046 111.5045 24.9392 3.7942 16.1914 19.8899 41.3813 6.0902 4.2583 3.6777 3.7779 24.1204 37.1381 10.5825 4.6490 7.6428 4.7081 3.9365 0.3850 0.1910 2.5520 0.5123 0.3316 3.8723 3.5671
temp: 298.150 k
press: 1.00000 atm
elementType: 35 35 15 8 6 6 6 6 6 1 1 1 1 1 1 1 1 1
symmnumber: 1
zpe: 347713.5 jmol-1
zpe.correction: 0.132437 hartree
zpe.thermalcorrener: 0.143547 hartree
zpe.thermalcorrenthalpy: 0.144491 hartree
zpe.thermalcorrgfe: 0.093443 hartree
zpe.sumelectzpe: -638.574265 hartree
zpe.sumelectthermal: -638.563155 hartree
zpe.sumelectthermalent: -638.562211 hartree
zpe.sumelectthermalfe: -638.613259 hartree
dipole: 3.2946 -2.0817 0.9480
dipole: 4.0108
quadrupole: -87.5864 -93.7490 -75.0808
quadrupole: 12.1213 -0.7791 3.5131
quadrupole: -2.1143 -8.2770 10.3913 12.1213 -0.7791 3.5131
hfenergy: -638.706702 hartree
pointgroup: C01[X(C5H9Br2O1P1)]
dipole: 0.6155511 -1.3727855 -0.4760011 debye
dipolederiv: -0.1812379 0.0328576 0.0224376 0.0813893 -0.717042 -0.1031691 0.059577 -0.1165765 -0.1855904 -0.1709593 -0.1366478 -0.0474578 -0.1639278 -0.6207905 -0.0845575 -0.075696 -0.0703799 -0.1536452 1.4857838 -0.03486 -0.0036696 0.0046879 1.1696699 0.0185809 -0.0065264 -0.0880272 1.0179573 -0.7463465 0.0633307 0.0240925 0.0886117 -0.6357213 -0.0213949 0.0265602 0.0029174 -0.5736287 -0.3342874 0.0179174 -0.0158786 0.097789 -0.323843 0.0158577 0.1095663 -0.0155978 -0.2852924 -0.3612391 0.0129289 0.0213704 -0.0862555 -0.2621087 0.0018288 -0.0996263 0.0024341 -0.2983229 0.1446154 -0.0331029 -0.1054128 -0.1673186 0.8887428 0.2002214 -0.3688503 0.2390568 0.131916 0.1999797 0.1256863 0.1193304 0.2785248 0.72633 0.1716079 0.3955704 0.1497849 0.1215577 -0.2722547 -0.0549697 -0.0241913 -0.1134937 -0.3437548 -0.0550062 -0.0414091 -0.0294946 -0.1959825 0.0818356 -0.0023253 0.0077481 -0.0331867 -0.0029151 0.0836017 0.0133366 0.0761218 0.0684547 0.0237002 0.0240886 -0.0079545 0.0085761 0.0349441 -0.0701159 -0.0220975 -0.0576736 0.0640111 0.0843602 -0.01428 0.0029025 0.017073 0.0232779 0.0543899 0.0079663 0.063123 0.0760646 0.0161469 -0.0377331 -0.0010425 -0.0201638 0.0115442 -0.1066838 -0.0014576 -0.087594 0.0163568 -0.0496464 0.0448452 -0.0399897 0.015198 -0.0401932 -0.0535309 -0.0098485 -0.0367847 0.0516001 -0.0582727 -0.0461285 0.0316951 -0.0162635 -0.0368617 -0.0626566 0.0051091 -0.0385434 0.0429571 0.0590232 0.0695046 0.0254953 0.0658537 -0.0388153 -0.0416685 0.0244761 -0.0453343 0.0905044 0.0331274 -0.0464029 0.0734943 -0.0585407 0.0739903 0.0296414 0.0798674 0.0334953 0.0204163 0.0456716 0.015291 -0.0829693 0.0014468 0.0935463 0.0230536 -0.0965178 0.0190726 -0.009334 unknown
polarizability: 103.4668361|4.3300712|146.0970229|1.3598945|14.8306036|83.3383449 unknown
InChI: InChI=1S/C5H9Br2OP/c1-9(8)2-4(6)5(7)3-9/h4-5H,2-3H2,1H3
charge 0 multiplicity 1
18 atoms
Br 1.436318 -2.451426 -0.208338
Br 1.8005 2.262171 0.17813
P  -1.344568 0.180784 0.046197
O  -2.260408 1.438623 0.472873
C  -0.052398 -0.39463 1.333836
C  -0.032299 0.481281 -1.314438
C  1.278883 -0.54434 0.586529
C  1.332361 0.422127 -0.613351
C  -2.334184 -1.326358 -0.479043
H  -0.366002 -1.318802 1.840547
H  0.021016 0.417745 2.079353
H  -0.227852 1.449567 -1.797345
H  -0.096384 -0.322733 -2.069231
H  2.167675 -0.484231 1.230054
H  2.175928 0.219731 -1.287698
H  -1.665076 -2.170721 -0.710802
H  -3.017292 -1.600156 0.341258
H  -2.93392 -1.062933 -1.36563
