program: Gaussian 09
title: 000264243
version: EM64L-G09RevD.01
frameworkgroup: C1[X(C12H19NO2S)]
method: RPBEPBE
basis: SDD
operation: Freq
keyword: #p
keyword: freq=noraman
keyword: PBEPBE/SDD
title: #p freq=noraman PBEPBE/SDD
converged: YES YES NO NO
title: Mulliken charges:
elementType: S O O N C C C C C C C C C C C C H H H H H H H H H H H H H H H H H H H
charge: 0.926111 -0.542283 -0.543080 -0.553241 0.290945 -0.376123 -0.719866 -0.725688 -0.370476 -0.693542 0.016560 -0.246123 -0.256410 -0.207052 -0.215749 -0.218085 0.250388 0.184384 0.310353 0.237720 0.215559 0.217367 0.230425 0.214214 0.239937 0.208098 0.189472 0.206406 0.217022 0.224847 0.278384 0.290163 0.240793 0.241282 0.237289
chargesum: 0.00000
title: Mulliken charges with hydrogens summed into heavy atoms:
elementType: S O O N C C C C C C C C C C C C
charge: 0.926111 -0.542283 -0.543080 -0.242888 0.290945 0.058649 -0.049220 -0.041111 0.027094 -0.045268 0.016560 0.032261 0.033753 0.033741 0.025533 0.019204
polarizability: 2.13584212e+02 -1.02872409e+01 1.35719007e+02 -9.71694573e-01 5.86611189e+00 1.52781480e+02
1716.lowfreq: -15.5950 -0.0023 -0.0017 0.0019 4.7667 10.9789 20.4410 34.0054 39.7689
frequency: 20.2517 33.8916 39.7442 63.0303 72.5901 130.7476 135.8001 161.9995 178.3710 204.2475 212.1631 219.5048 222.0141 242.2794 248.4376 255.3451 312.7892 335.6738 342.1884 356.1517 393.3370 401.8141 422.5249 462.3921 492.2599 513.2176 520.9230 603.0660 656.2425 689.8117 739.8580 759.2329 761.4451 794.6517 812.8856 847.8844 857.2700 868.8816 910.7035 925.6617 932.9112 937.2992 956.6657 978.6665 982.1496 1000.4309 1004.6272 1009.0080 1049.3247 1051.3387 1068.2206 1077.3473 1100.0439 1172.9193 1175.3139 1177.4630 1190.8912 1214.7986 1263.2860 1292.1475 1302.4820 1315.1458 1331.9412 1364.4989 1371.1286 1384.0418 1387.2555 1389.7107 1436.8578 1451.4456 1453.7401 1463.8373 1467.4514 1471.1974 1473.4462 1476.1308 1485.4187 1491.4750 1578.6795 1605.1750 2959.6736 2974.0567 2976.2712 2983.6706 2987.5097 3012.2134 3043.6716 3071.1596 3077.3133 3078.5724 3086.5046 3092.1783 3098.6376 3136.6896 3147.6617 3157.1948 3166.6133 3175.7206 3325.5543
redmass: 4.0208 4.2042 4.3158 2.1228 2.8556 5.3883 3.2179 3.2939 3.7556 1.7204 2.2127 3.5072 1.8880 1.4535 7.6432 1.1143 2.7964 2.9196 5.6179 3.4221 4.6774 2.8263 4.1813 2.8112 2.6163 3.9756 4.0548 6.4744 6.6049 2.2998 1.1303 3.0330 1.5360 14.5136 1.8615 1.2479 1.6351 1.9020 2.2068 5.0934 1.3715 1.4307 1.6967 5.1443 1.4534 1.2899 1.3327 3.9650 2.1605 2.5866 1.4459 1.5425 2.1949 1.0702 2.0132 1.1294 2.1519 2.9729 1.3914 1.2381 1.3034 1.1105 1.3905 1.5073 1.2019 7.9078 1.2189 1.2122 2.2488 1.0847 1.9674 1.0653 1.0516 1.0612 1.0561 1.0431 1.0710 1.0573 5.8485 6.9585 1.0612 1.0448 1.0508 1.0351 1.0358 1.0975 1.1022 1.1003 1.0997 1.0997 1.0989 1.1007 1.0998 1.0857 1.0886 1.0929 1.0968 1.1011 1.0736
irintensity: 0.7320 0.7529 0.9757 0.1625 0.4676 1.6893 1.6809 0.3501 2.0836 0.9814 0.1855 9.1310 1.5444 1.1838 6.9228 0.1372 0.2525 2.1810 1.0393 5.6567 10.1790 0.1456 67.5262 30.6929 25.6618 78.7112 14.6787 0.0274 4.4034 33.9341 13.8549 15.7349 67.4983 65.0047 133.7952 0.8199 2.8486 2.7498 23.2714 53.6508 1.9228 0.7382 1.3698 1.6642 0.1353 4.2510 0.1931 1.2805 25.8485 3.9653 1.6156 4.9474 4.9110 1.7505 16.1676 6.9951 36.5770 43.5385 7.7375 7.5486 3.6406 2.3753 2.1185 5.2217 19.2488 5.5756 8.4333 15.7626 16.2529 2.4919 17.4169 7.8504 3.4918 3.0944 8.9669 10.5123 7.0008 32.1783 3.7224 0.3965 17.3503 15.6819 62.5800 24.1409 19.8774 14.6951 12.1497 53.0935 16.1603 54.2496 36.0006 9.2840 42.1579 1.0367 10.6489 2.7973 7.6514 23.5845 12.6547
temp: 298.150 k
press: 1.00000 atm
elementType: 16 8 8 7 6 6 6 6 6 6 6 6 6 6 6 6 1 1 1 1 1 1 1 1 1 1 1 1 1 1 1 1 1 1 1
symmnumber: 1
zpe: 754293.7 jmol-1
zpe.correction: 0.287295 hartree
zpe.thermalcorrener: 0.305703 hartree
zpe.thermalcorrenthalpy: 0.306647 hartree
zpe.thermalcorrgfe: 0.239943 hartree
zpe.sumelectzpe: -1070.517522 hartree
zpe.sumelectthermal: -1070.499114 hartree
zpe.sumelectthermalent: -1070.498170 hartree
zpe.sumelectthermalfe: -1070.564875 hartree
dipole: -1.3943 4.7627 -0.5885
dipole: 4.9974
quadrupole: -84.3037 -116.1799 -103.5918
quadrupole: -1.1636 -2.2537 1.3950
quadrupole: 17.0548 -14.8214 -2.2333 -1.1636 -2.2537 1.3950
hfenergy: -1070.8048172 hartree
pointgroup: C01 [X(C12H19N1O2S1)]
dipole: 0.4461762 1.6714798 0.9341803 debye
polarizability: 211.8318507|14.8719485|144.4478566|2.2364818|-10.320984|145.8049922 unknown
InChI: InChI=1S/C12H19NO2S/c1-4-10-12(2,3)13-16(14,15)11-8-6-5-7-9-11/h5-9,13H,4,10H2,1-3H3
charge 0 multiplicity 1
35 atoms
S  0.132564 -1.136713 -0.358054
O  -0.391198 -0.777017 -1.86647
O  0.231707 -2.682888 0.156088
N  -0.85251 -0.320157 1.018428
C  -1.824136 0.788134 0.687388
C  -3.009375 0.334721 -0.226567
C  -2.320631 1.242962 2.088244
C  -1.053173 1.944856 0.010755
C  -3.88102 -0.827132 0.303893
C  -4.973323 -1.228958 -0.712244
C  1.832613 -0.330914 -0.172476
C  2.609494 -0.681274 0.943189
C  2.261274 0.536169 -1.188263
C  3.895096 -0.102676 1.050655
C  3.551246 1.103434 -1.063315
C  4.360501 0.78784 0.053135
H  -2.590365 0.051024 -1.211176
H  -3.655475 1.220571 -0.394435
H  -1.335921 -1.146341 1.428963
H  -1.479614 1.640383 2.680846
H  -3.080829 2.036719 1.967573
H  -2.781276 0.414745 2.656303
H  -0.157157 2.211551 0.598314
H  -1.703975 2.834559 -0.057761
H  -0.746541 1.671109 -1.014251
H  -4.358968 -0.545973 1.263075
H  -3.24951 -1.717047 0.508004
H  -5.643742 -0.376687 -0.932453
H  -5.594544 -2.058954 -0.329124
H  -4.519582 -1.555753 -1.665926
H  2.231735 -1.386572 1.689587
H  1.614562 0.739089 -2.048164
H  4.53051 -0.350384 1.907274
H  3.921075 1.782911 -1.83819
H  5.358886 1.229658 0.142556
