program: Gaussian 09
title: 000264201
version: EM64L-G09RevD.01
frameworkgroup: C1[X(C12H11NO2)]
method: RPBEPBE
basis: SDD
operation: Freq
keyword: #p
keyword: freq=noraman
keyword: PBEPBE/SDD
title: #p freq=noraman PBEPBE/SDD
converged: YES YES NO NO
title: Mulliken charges:
elementType: O O N C C C C C C C C C C C C H H H H H H H H H H H
charge: -0.294984 -0.440227 -0.130229 0.445032 0.458699 -0.553485 -0.402763 0.257409 -0.412644 -0.424155 0.060819 -0.266847 -0.251010 -0.255357 -0.516609 0.236486 0.206612 0.239242 0.239808 0.260621 0.233441 0.233984 0.262902 0.210754 0.230068 0.372429
chargesum: 0.00000
title: Mulliken charges with hydrogens summed into heavy atoms:
elementType: O O N C C C C C C C C C C C C
charge: -0.294984 -0.067798 -0.130229 0.445032 0.458699 -0.316998 -0.196151 0.257409 -0.173401 -0.184347 0.060819 -0.006225 -0.017568 -0.021373 0.187115
polarizability: 2.93347061e+02 -1.16882392e+01 1.54542942e+02 -3.16168565e+00 -5.11375070e+00 6.43065344e+01
1716.lowfreq: -3.4023 -0.5573 -0.0005 0.0004 0.0004 9.0767 34.1491 68.8181 93.7995
frequency: 34.1141 68.8022 93.7976 142.8944 169.9010 190.1234 213.6617 245.0660 288.1842 307.3822 331.1259 344.5823 354.2373 417.2740 446.4479 463.8236 518.4082 533.7934 584.5738 598.4159 630.1318 693.2074 701.8649 743.3489 761.4609 773.4669 790.3751 841.3951 870.5451 881.9166 906.1696 925.0421 945.5629 961.1242 989.1168 1015.6760 1047.1849 1093.3990 1101.2612 1120.0562 1151.7406 1175.5287 1185.1735 1234.4838 1236.9537 1256.2558 1303.0416 1313.6132 1401.3345 1403.0217 1414.2049 1432.8250 1438.7222 1453.5211 1480.8259 1484.9904 1502.7967 1561.3395 1603.5909 1615.1726 1642.9361 2977.1642 3087.5395 3088.1571 3114.4846 3121.4141 3127.7098 3127.8278 3145.0757 3147.1698 3165.8381 3576.7266
redmass: 4.3875 2.7154 1.8424 2.4697 2.9199 4.0873 5.5279 6.1513 5.1383 5.5128 4.3074 3.9331 2.8936 1.7653 6.8248 1.9569 6.3866 3.8352 3.4765 5.9172 6.4381 5.8309 2.9783 5.5076 1.2960 3.5495 4.5031 1.5194 6.0053 1.5066 9.3632 1.6289 5.7050 1.4225 1.3611 1.3087 2.4290 4.2165 1.2417 1.9670 1.4844 1.3181 1.5043 2.1074 1.3655 1.7129 1.9535 1.5315 2.3819 2.2278 1.3248 1.5548 2.8288 1.0717 1.1872 1.9992 3.6635 7.0250 5.7588 7.1656 7.2214 1.0337 1.0870 1.0977 1.0870 1.0868 1.0939 1.0992 1.0934 1.0897 1.1006 1.0674
irintensity: 1.3794 4.7071 1.0082 5.0558 1.6944 1.9578 1.8911 0.7125 0.3669 2.6067 5.4605 23.0369 31.3737 95.7295 0.5545 16.6336 0.8700 11.7966 7.9460 32.7876 9.3170 2.4029 6.4948 1.5988 60.3424 2.4516 18.5454 29.3218 51.0130 31.4679 200.1550 7.5958 14.0597 14.4532 0.3639 0.1008 15.6477 170.1410 17.0020 2.9253 51.2843 3.5725 24.4357 65.0771 70.7048 15.6735 3.3419 17.1969 0.7585 2.1749 17.5124 37.4036 22.2703 11.4508 24.5482 16.6785 12.2324 15.6773 2.5237 46.0723 22.7300 100.8837 20.8784 33.9866 4.6016 10.7965 3.6303 10.8327 23.7285 6.7366 35.5738 90.3767
temp: 298.150 k
press: 1.00000 atm
elementType: 8 8 7 6 6 6 6 6 6 6 6 6 6 6 6 1 1 1 1 1 1 1 1 1 1 1
symmnumber: 1
zpe: 527015.4 jmol-1
zpe.correction: 0.200730 hartree
zpe.thermalcorrener: 0.213821 hartree
zpe.thermalcorrenthalpy: 0.214765 hartree
zpe.thermalcorrgfe: 0.160883 hartree
zpe.sumelectzpe: -667.922974 hartree
zpe.sumelectthermal: -667.909882 hartree
zpe.sumelectthermalent: -667.908938 hartree
zpe.sumelectthermalfe: -667.962821 hartree
dipole: -0.5800 -0.2868 1.3680
dipole: 1.5133
quadrupole: -67.1081 -79.5573 -92.1743
quadrupole: -0.7711 2.9185 1.2840
quadrupole: 12.5052 0.0559 -12.5611 -0.7711 2.9185 1.2840
hfenergy: -668.1237033 hartree
pointgroup: C01 [X(C12H11N1O2)]
dipole: -0.2615575 0.0541125 -0.5320939 debye
dipolederiv: -1.3537908 0.5844174 0.1447982 0.7161981 -0.7450169 -0.1316277 -0.1800642 0.0691304 -0.336468 -0.4598209 -0.2731938 0.0725969 -1.328562 -1.0048619 -0.0233159 0.261167 0.0914031 -0.3677736 -0.2672143 0.1397898 -0.005241 1.1799542 0.5171463 -0.0325658 -0.1924747 -0.1691054 -0.2005547 0.2444949 -0.2609108 -0.0024819 0.0051411 0.0369933 0.0182871 -0.0068177 0.0211748 0.0478899 -0.2122312 -0.0657568 -0.0024513 -0.0579073 -0.2165059 0.0455136 0.0403635 0.0915188 0.0339402 -0.2325948 0.361245 0.0096692 -0.1453405 0.0144027 -0.0626342 0.0941366 -0.102871 -0.1614026 0.4067047 0.1281237 -0.0032081 0.2079642 0.2895363 -0.120971 -0.0840301 -0.1509717 -0.0956329 0.8592814 -0.5365549 -0.0046181 -0.7529357 0.6276984 0.0820368 0.3237999 -0.1039213 0.0057606 -0.203692 0.0918418 0.0171578 0.029116 0.1284219 -0.0703809 -0.0001921 -0.0781739 -0.1486006 0.0645962 0.0958889 -0.0111992 -0.1204208 0.1097454 -0.0686059 0.0234955 -0.0733507 -0.1444639 0.4130281 0.0624019 0.0470615 0.0762155 -0.0897613 -0.012074 -0.075701 0.0439814 0.055816 -0.3867309 -0.0989418 -0.0268427 0.0816938 0.0367925 -0.0318504 -0.0020531 -0.0198391 -0.0842642 0.017074 -0.0173842 -0.0362186 0.1239599 0.1088096 -0.0525098 -0.0594833 -0.0684559 -0.130075 -0.0537684 -0.1070385 0.0072724 -0.1454933 -0.1780757 -0.0174924 0.0259116 0.0133484 -0.1624337 0.747397 -0.3210824 -0.141204 -0.0755695 0.2437506 0.0716292 -0.2502272 0.1866524 0.4025286 0.0688739 -0.0411763 0.0117557 0.0279099 -0.0617109 0.030188 -0.0076813 0.0198977 0.132377 0.0259481 0.09937 -0.0272561 0.0335726 -0.0845541 0.0655096 -0.0096886 0.0556406 0.1016184 0.0813318 0.0679817 -0.0111176 0.0021045 -0.0834366 0.0606049 0.0087839 0.0549157 0.1362958 0.0840895 -0.0105502 0.0096479 0.062035 -0.0920893 0.063083 -0.0120468 0.0672544 0.1346447 0.0662167 -0.0512643 0.0177672 0.0026296 0.006045 0.0465351 -0.0218938 0.0355541 0.1435474 -0.0609654 -0.0934093 0.0426967 -0.1118347 0.0238887 0.0457508 0.0494976 0.0419968 0.1450623 -0.1142443 0.0667888 0.0027504 0.0826336 0.0661138 0.0201213 0.000439 0.0208253 0.1596495 0.0056253 -0.0491439 0.0317966 -0.2222895 0.0782821 0.0295569 0.0309152 -0.0143026 0.0655762 -0.0384526 0.0138977 -0.094584 0.0058849 0.071986 -0.0227345 0.0949263 -0.1246354 -0.1707566 0.0267098 0.0971003 0.0033786 0.1777553 -0.1019695 0.0352278 -0.0103211 0.0566295 0.0685851 0.2721341 0.1175604 -0.0519266 0.1455851 0.2983695 0.0327184 -0.0407609 0.0357037 0.3691341 unknown
polarizability: 292.8554939|9.8822896|152.1145706|-12.4655986|-15.6235344|67.2264728 unknown
InChI: InChI=1S/C12H11NO2/c1-15-12-8-10-5-3-2-4-9(10)6-7-11(12)13-14/h2-8,14H,1H3
charge 0 multiplicity 1
26 atoms
O  2.179138 -1.909275 0.249064
O  3.453774 2.071198 -0.235406
N  3.070091 0.668801 -0.02232
C  -1.343897 -0.611529 0.139087
C  -1.564547 0.768293 -0.213652
C  -0.058193 -1.289993 0.175384
C  -0.511671 1.716694 -0.554732
C  1.251957 -0.869439 0.036868
C  -2.486511 -1.417827 0.441433
C  -2.90349 1.262485 -0.247156
C  1.742914 0.510206 -0.180613
C  0.859491 1.618545 -0.541706
C  -3.793878 -0.905718 0.411983
C  -4.008153 0.452016 0.062124
C  3.27267 -2.127564 -0.723142
H  -0.120167 -2.369285 0.370634
H  -0.89526 2.702702 -0.856359
H  -2.324431 -2.469259 0.70646
H  -3.063464 2.312092 -0.522102
H  1.410309 2.527249 -0.808631
H  -4.642256 -1.554017 0.655851
H  -5.02225 0.863643 0.031038
H  3.985362 -1.288836 -0.702752
H  2.858752 -2.258863 -1.741461
H  3.750203 -3.06178 -0.390287
H  4.43041 2.037758 -0.072708
