program: Gaussian 09
title: 000256176
version: EM64L-G09RevD.01
frameworkgroup: C1[X(C22H27NO7)]
method: RPBEPBE
basis: SDD
operation: Freq
keyword: #p
keyword: freq=noraman
keyword: PBEPBE/SDD
title: #p freq=noraman PBEPBE/SDD
converged: YES YES NO NO
title: Mulliken charges:
elementType: O O O O O O O N C C C C C C C C C C C C C C C C C C C C C C H H H H H H H H H H H H H H H H H H H H H H H H H H H
charge: -0.234414 -0.234444 -0.460993 -0.307273 -0.291629 -0.298023 -0.281451 -0.224406 0.308853 -0.193785 -0.182794 -0.377734 -0.394451 -0.439424 0.430087 0.443126 -0.532417 -0.530906 -0.381424 -0.419895 0.223175 0.227905 -0.339644 -0.332014 0.179294 0.211286 -0.529443 -0.521120 -0.530106 -0.535969 0.241175 0.236033 0.230496 0.219251 0.217978 0.241571 0.218740 0.233806 0.352676 0.275351 0.266103 0.264877 0.267317 0.250297 0.238502 0.227376 0.250287 0.227783 0.207926 0.257410 0.228289 0.229374 0.254495 0.220923 0.243334 0.228064 0.220599
chargesum: 0.00000
title: Mulliken charges with hydrogens summed into heavy atoms:
elementType: O O O O O O O N C C C C C C C C C C C C C C C C C C C C C C
charge: -0.234414 -0.234444 -0.108317 -0.307273 -0.291629 -0.298023 -0.281451 -0.224406 0.308853 0.047391 0.053239 0.072013 0.065098 0.013123 0.430087 0.443126 -0.257066 -0.264803 -0.116547 -0.152578 0.223175 0.227905 -0.089347 -0.093512 0.179294 0.211286 0.176003 0.172504 0.174685 0.156029
polarizability: 3.28903599e+02 1.19609827e+00 2.95130978e+02 -2.25174125e+00 2.19472289e+01 1.85176994e+02
1716.lowfreq: -7.4273 -5.0408 -0.0008 -0.0004 0.0005 5.2569 6.5918 15.5274 21.2217
frequency: 2.9111 15.5150 21.2126 25.2370 40.9734 57.2466 63.3176 70.9527 90.9965 95.8175 98.9538 104.2997 115.6517 126.2221 144.0463 152.3756 158.6246 164.3959 171.9477 183.6552 187.1277 201.9307 220.8344 238.6078 240.1363 244.0790 254.9161 267.8425 299.9034 317.8781 334.0511 341.9061 352.4028 360.3930 373.0108 392.7648 402.4407 439.4125 450.0695 464.2568 487.2694 496.7380 535.3269 561.8377 586.9919 593.3604 599.6844 614.7639 626.2904 632.4346 683.7630 706.7690 709.5774 714.0858 733.2101 750.0391 763.8792 773.3952 789.5410 815.6907 832.8609 859.6537 872.6712 885.4956 897.7217 909.4955 913.3880 929.1242 931.7021 947.5972 948.5789 952.9991 961.9907 966.2238 969.2041 976.8396 984.8148 985.0969 999.8021 1045.4023 1077.4449 1090.2040 1092.4663 1106.3059 1110.7950 1111.5897 1112.5735 1113.8618 1130.5169 1136.4599 1142.1508 1145.3235 1151.9998 1155.1470 1155.9818 1170.7673 1171.9723 1179.6117 1184.7002 1200.0107 1235.6666 1239.8099 1242.9050 1250.7531 1253.2668 1262.2707 1264.6650 1276.3150 1296.8062 1309.5537 1324.0029 1346.1006 1365.8501 1376.0436 1390.3690 1394.1072 1395.8945 1423.0733 1431.3132 1440.0832 1441.0566 1454.8757 1457.3075 1459.1622 1460.5168 1466.4701 1468.5645 1473.2748 1476.0841 1480.1413 1481.4885 1484.3639 1486.8704 1493.0833 1570.7106 1578.9953 1610.8868 1613.4010 2961.9081 2962.2451 2970.9812 2971.4899 2972.6733 2983.9616 2991.4046 3013.3343 3025.0337 3028.8661 3051.5410 3067.5175 3069.2032 3079.5565 3110.6447 3119.9966 3120.6315 3123.0744 3123.6350 3124.6278 3146.9141 3147.0344 3166.6715 3167.1920 3171.1530 3176.1667 3583.8898
redmass: 4.7749 4.4006 4.3440 4.6997 4.7535 3.5075 2.6442 2.8402 4.0013 3.4910 4.0204 2.8563 3.4589 2.0807 2.4870 1.3974 1.2036 2.1939 3.7003 2.9725 2.9902 4.4275 4.5802 2.4704 1.4621 1.4124 3.5356 5.6143 3.6929 5.6756 5.2058 3.4181 3.8024 3.8879 3.0907 4.3085 4.3880 3.7838 4.6785 4.1843 4.1239 3.7498 5.6058 5.2012 5.1098 5.5306 4.6145 4.7576 4.6334 4.8843 10.5643 5.9676 6.0049 5.8006 3.7825 3.7510 3.7457 3.6458 4.4214 1.6531 1.8245 2.4064 4.3808 4.7175 2.5574 2.9190 1.8935 2.7265 2.1136 3.2534 6.4942 1.8185 1.7566 1.7523 3.6831 3.4334 3.0941 7.2840 3.6392 3.9394 2.8282 2.8377 4.4413 2.4026 1.2400 1.2622 1.2458 1.2442 1.5303 1.5834 1.5973 1.4762 1.2883 1.4189 1.4190 1.2436 1.3294 1.1802 1.7418 2.1255 1.5650 1.8503 1.4082 1.6986 2.7780 1.7250 1.4210 1.6609 1.8765 1.2018 1.4205 1.5049 5.0540 5.3317 2.8791 2.9861 1.5591 1.1842 1.2376 1.2802 1.3206 1.0687 1.0563 1.0705 1.0846 1.0503 1.0842 1.1265 1.1759 2.1138 1.0657 1.0892 1.0546 2.4801 7.9483 8.0747 6.8505 6.7041 1.0338 1.0542 1.0308 1.0350 1.0310 1.0679 1.0674 1.0867 1.1078 1.0866 1.1040 1.1041 1.1038 1.0968 1.0991 1.1025 1.1028 1.0979 1.0999 1.1042 1.0877 1.0870 1.0950 1.0954 1.0925 1.0905 1.0667
irintensity: 0.8934 0.6021 0.1171 0.5107 0.2289 0.6895 8.3122 1.2387 5.4923 2.3697 2.4588 5.7965 4.6598 1.5725 2.4133 2.1032 2.0985 5.1686 5.5470 0.8467 1.2317 3.1216 1.1761 5.0179 1.3113 110.5210 49.5966 9.9444 8.1178 1.8367 2.1518 1.1446 1.5496 0.1095 8.0912 2.6051 1.5297 2.2064 2.4534 5.8415 7.6314 6.0341 16.9553 18.7689 8.6361 13.2673 12.4617 7.8864 8.0791 14.9710 4.6873 3.5106 14.4377 30.3247 5.0214 10.5828 23.4294 32.0063 22.0609 36.4802 40.8630 16.8784 49.1967 10.5929 40.0849 34.1608 30.0749 4.9480 60.9155 11.0118 53.2360 12.6432 4.6394 4.7017 55.0527 38.5382 8.7348 38.4291 39.1948 72.6970 16.2088 138.8463 24.8880 166.7727 6.2935 0.8334 10.5048 2.6375 20.6252 13.5831 18.0330 6.0773 2.0419 14.9377 2.8868 0.1560 4.4881 24.2754 21.2884 20.6761 22.6643 85.0207 15.2554 34.7137 249.2176 37.6177 8.0602 43.1549 90.6705 4.8383 62.4457 40.6561 1.4628 21.1455 17.6908 13.3144 1.1028 0.8911 1.0410 20.2168 18.1399 16.0833 11.1230 9.6858 2.2182 13.5771 7.0815 80.4596 21.4881 63.3273 32.8038 8.6511 21.5259 103.7633 8.5358 18.6149 5.7634 13.0048 70.5486 39.4974 82.1125 76.7208 56.0471 39.5767 55.1770 7.0639 58.4644 26.0746 44.0353 32.9041 21.9290 40.8980 13.5736 21.6773 26.5006 33.0791 19.5586 17.7604 3.0964 5.2779 11.8330 8.0901 1.5112 1.7473 6.1357
temp: 298.150 k
press: 1.00000 atm
elementType: 8 8 8 8 8 8 8 7 6 6 6 6 6 6 6 6 6 6 6 6 6 6 6 6 6 6 6 6 6 6 1 1 1 1 1 1 1 1 1 1 1 1 1 1 1 1 1 1 1 1 1 1 1 1 1 1 1
symmnumber: 1
zpe: 1195553.6 jmol-1
zpe.correction: 0.455362 hartree
zpe.thermalcorrener: 0.485742 hartree
zpe.thermalcorrenthalpy: 0.486686 hartree
zpe.thermalcorrgfe: 0.389599 hartree
zpe.sumelectzpe: -1433.482776 hartree
zpe.sumelectthermal: -1433.452396 hartree
zpe.sumelectthermalent: -1433.451452 hartree
zpe.sumelectthermalfe: -1433.548540 hartree
dipole: -2.0781 2.7329 3.8091
dipole: 5.1280
quadrupole: -143.5808 -179.9955 -168.9641
quadrupole: 0.5275 2.6855 2.4443
quadrupole: 20.5993 -15.8153 -4.7840 0.5275 2.6855 2.4443
hfenergy: -1433.9381385 hartree
pointgroup: C01 [X(C22H27N1O7)]
dipole: 0.7550401 -0.8740915 1.6541422 debye
polarizability: 322.9328514|10.4441618|295.0377404|25.7133976|-23.454519|191.2409797 unknown
InChI: InChI=1S/C22H27NO7/c1-25-16-7-5-14(9-18(16)27-3)20-23-21(30-13-22(23,11-24)12-29-20)15-6-8-17(26-2)19(10-15)28-4/h5-10,20-21,24H,11-13H2,1-4H3
charge 0 multiplicity 1
57 atoms
O  -2.034944 2.743936 -1.377166
O  1.140823 3.363103 -0.544824
O  -1.329334 2.601699 2.92872
O  -2.548816 -3.085417 0.317851
O  3.060718 -2.40026 0.347398
O  -5.207734 -2.853398 -0.888691
O  5.575862 -1.174674 0.871912
N  -0.259977 1.441904 -0.493743
C  -0.708977 2.362857 0.627287
C  -1.351506 1.423007 -1.489434
C  1.062714 1.942498 -0.965316
C  -2.025571 3.018211 0.074398
C  0.475758 3.368815 0.772643
C  -0.954949 1.586771 1.925136
C  -2.356914 0.28581 -1.273208
C  2.242745 1.143868 -0.400401
C  -2.015503 -0.886245 -0.561642
C  2.144543 -0.250539 -0.188131
C  -3.64285 0.384967 -1.862883
C  3.47855 1.784023 -0.15644
C  -2.940218 -1.942498 -0.423823
C  3.248481 -1.009067 0.25154
C  -4.577303 -0.660268 -1.714861
C  4.595066 1.041918 0.287133
C  -4.243881 -1.822489 -0.984528
C  4.499987 -0.356373 0.481857
C  -2.453479 -4.326829 -0.486225
C  3.456224 -3.062992 1.606885
C  -5.638983 -3.178369 0.490901
C  6.886395 -0.538574 1.02801
H  -0.942534 1.384923 -2.515251
H  1.097488 1.953729 -2.070627
H  -2.048949 4.110656 0.193169
H  -2.914525 2.568286 0.55862
H  1.176961 3.033787 1.563122
H  0.153907 4.399505 0.973546
H  -0.028978 1.051618 2.219645
H  -1.768612 0.84872 1.778453
H  -1.547162 2.158529 3.785612
H  -1.023974 -0.990047 -0.112478
H  1.200458 -0.773973 -0.360501
H  -3.9107 1.295578 -2.408044
H  3.557412 2.864652 -0.310268
H  -5.580734 -0.593965 -2.147605
H  5.542287 1.559999 0.465434
H  -1.659797 -4.22347 -1.249986
H  -3.417987 -4.555864 -0.974919
H  -2.184009 -5.119919 0.227901
H  2.893376 -2.635573 2.459891
H  4.53982 -2.966314 1.783012
H  3.177239 -4.118942 1.469503
H  -6.338727 -4.021597 0.38701
H  -4.776276 -3.46304 1.119345
H  -6.159954 -2.310538 0.93847
H  7.572089 -1.357621 1.290686
H  7.215316 -0.064234 0.083529
H  6.876739 0.215015 1.83938
