program: Gaussian 09
title: 000264183
version: EM64L-G09RevD.01
frameworkgroup: C1[X(C7H16S)]
method: RPBEPBE
basis: SDD
operation: Freq
keyword: #pfreq=noraman
keyword: PBEPBE/SDD
title: #p freq=noraman PBEPBE/SDD
converged: YES YES NO NO
title: Mulliken charges:
elementType: S C C C C C C C H H H H H H H H H H H H H H H H
charge: 0.127440 -0.056548 -0.648802 -0.674865 -0.648882 -0.614550 -0.338449 -0.673482 0.233044 0.205676 0.218491 0.230841 0.230807 0.207640 0.218502 0.205696 0.233048 0.238093 0.238089 0.214643 0.214630 0.208721 0.221491 0.208724
chargesum: 0.00000
title: Mulliken charges with hydrogens summed into heavy atoms:
elementType: S C C C C C C C
charge: 0.127440 -0.056548 0.008409 -0.005577 0.008365 -0.138367 0.090824 -0.034546
polarizability: 1.24590972e+02 7.70818586e-01 8.56033549e+01 -2.33487761e-03 -1.02449506e-03 7.72555530e+01
1716.lowfreq: -17.5612 -0.0034 -0.0028 0.0011 3.8796 10.7085 22.2261 53.8483 105.5174
frequency: -7.1689 52.6218 105.4948 107.5724 198.1528 222.6090 244.7714 252.3779 252.7483 271.6869 287.4400 335.5878 383.7957 386.0513 405.7305 540.7731 707.0771 751.6499 799.9310 859.8874 898.9165 925.6549 930.9800 949.6824 1020.6995 1020.7754 1038.7120 1047.6280 1101.9184 1167.7917 1214.3191 1234.3811 1236.2186 1236.7343 1285.3394 1332.8079 1375.7217 1376.2988 1390.3062 1400.8207 1450.3030 1454.9103 1462.5060 1465.1978 1474.7178 1476.3124 1476.8785 1478.3338 1486.1359 1492.4451 2969.6052 2972.6804 2976.3515 2977.7095 2990.1271 3004.5210 3036.1455 3059.5943 3064.2082 3069.2330 3072.9585 3077.2137 3084.7947 3085.9562 3091.8664 3094.3968
redmass: 1.6416 3.3840 3.4637 2.4077 1.0418 1.1082 3.2335 1.1047 1.3975 1.6143 2.5938 2.7721 3.5381 2.3903 2.6157 3.6728 5.0889 1.0826 3.0783 1.1861 1.9556 1.5813 1.5932 1.2015 1.4192 1.4199 1.1530 2.7851 2.1524 1.9481 1.4494 3.0505 2.8908 1.2302 1.1066 1.4378 1.2089 1.2069 1.2083 1.2028 1.0494 1.0829 1.0478 1.0493 1.0539 1.0490 1.0547 1.0421 1.0825 1.0501 1.0373 1.0366 1.0353 1.0363 1.0598 1.0553 1.1013 1.0964 1.0966 1.1035 1.0977 1.0992 1.1038 1.1032 1.0998 1.0995
irintensity: 0.1701 1.0587 0.3762 1.4801 0.0016 0.0004 0.8208 0.0022 0.0203 0.1575 1.0374 0.3554 0.7368 0.0792 0.2908 7.1254 3.3790 9.2052 0.1549 0.1667 9.6991 0.6220 1.7201 0.0343 0.7046 1.7171 1.2261 1.6286 18.6957 86.3151 0.3550 5.8862 10.7772 5.7189 0.0171 1.6689 26.6734 28.5517 12.1658 9.0059 0.9007 2.5940 0.0743 1.5365 12.6312 5.7002 8.0938 14.3556 10.0605 23.1158 23.7458 30.3185 50.5718 34.4909 9.3489 41.9208 0.6465 2.7834 41.8556 4.7055 60.4616 45.0580 31.7140 69.3501 32.3756 38.1252
temp: 298.150 k
press: 1.00000 atm
elementType: 16 6 6 6 6 6 6 6 1 1 1 1 1 1 1 1 1 1 1 1 1 1 1 1
symmnumber: 1
zpe: 560431.1 jmol-1
zpe.correction: 0.213457 hartree
zpe.thermalcorrener: 0.224414 hartree
zpe.thermalcorrenthalpy: 0.225358 hartree
zpe.thermalcorrgfe: 0.177405 hartree
zpe.sumelectzpe: -673.715932 hartree
zpe.sumelectthermal: -673.704975 hartree
zpe.sumelectthermalent: -673.704031 hartree
zpe.sumelectthermalfe: -673.751984 hartree
dipole: 0.1029 1.6852 -0.0008
dipole: 1.6883
quadrupole: -54.7302 -61.9449 -60.5139
quadrupole: 0.3061 -0.0006 0.0003
quadrupole: 4.3328 -2.8819 -1.4509 0.3061 -0.0006 0.0003
hfenergy: -673.9293891 hartree
pointgroup: C01 [X(C7H16S1)]
dipole: -0.0324105 -0.6634434 -0.0029185 debye
dipolederiv: -0.4327143 -0.0794261 -0.0002396 -0.0682426 -0.1267667 0.0007063 -0.0001851 0.0005357 -0.2749454 0.5525467 0.1984064 0.0006603 0.3207742 0.1904471 -0.0002793 0.0012183 -0.0001404 0.2138529 -0.0663404 -0.0247216 0.0164832 -0.0357035 -0.0391677 0.0732242 -0.0520484 0.0340131 -0.0805533 -0.1143841 0.0975535 0.0003821 -0.0754902 -0.0258735 -0.0000815 -0.0003461 -0.0000989 0.0209683 -0.0664055 -0.0245554 -0.0165887 -0.0360624 -0.0384462 -0.0729458 0.0518752 -0.0337065 -0.0812677 0.2062875 -0.1244423 -0.0005184 -0.260143 0.0321282 -0.0005652 -0.0009968 -0.0005796 0.1935153 0.0240934 -0.0118017 -0.0000063 0.2288471 0.0735011 -0.0003636 0.0008542 -0.00024 0.1443232 -0.110975 0.0547676 0.0002762 -0.0528736 0.0592514 -0.0001221 -0.0000902 -0.0001613 0.105076 0.107312 -0.0039353 -0.0063909 0.0144935 0.0182806 -0.1321491 -0.0003546 -0.0704119 -0.0845445 -0.1278761 -0.1494086 0.0307835 -0.1504752 -0.000768 0.0373246 0.0161936 0.0190651 0.0711002 -0.0442621 0.1547994 -0.0321463 0.1294283 -0.0131521 0.0164655 0.0067304 -0.0012516 0.0725459 0.1111553 -0.012288 0.0190395 0.0318869 0.0116448 0.104374 -0.0181595 0.1273684 -0.0690403 0.1111081 -0.0120117 -0.0190011 0.0318694 0.0133816 -0.1037271 0.0185915 -0.1267685 -0.0707962 -0.1706171 -0.0712359 -0.0003475 -0.1268251 0.0139787 -0.0004107 -0.0006091 -0.0003791 0.1035031 -0.0443254 0.1545773 0.0331745 0.1295263 -0.0128965 -0.0169437 -0.0058756 0.0007227 0.0723878 -0.1277432 -0.1492226 -0.0319167 -0.150336 -0.0004384 -0.0378758 -0.0173623 -0.0196389 0.070734 0.1072977 -0.0040113 0.006483 0.0144267 0.0168703 0.1328459 0.0005461 0.0711231 -0.0831484 0.0003997 0.0283644 -0.002177 0.0555296 -0.0592918 -0.1045181 -0.0084763 -0.1095782 -0.0613765 0.0003029 0.0285016 0.0023124 0.0556098 -0.0609312 0.104491 0.0087793 0.1095784 -0.0597616 0.0538318 0.0264847 -0.0104279 -0.0187043 -0.0208731 0.1102605 0.0192136 0.1253251 -0.0655953 0.0538846 0.0263636 0.0105247 -0.018638 -0.0192401 -0.1099077 -0.0194118 -0.1250106 -0.067216 0.0906075 -0.0096163 -0.0314791 0.0450596 -0.016275 -0.1194129 0.0167492 -0.134592 -0.0876808 -0.2038069 -0.0833993 -0.0001743 -0.1091953 0.0226433 -0.0002406 -0.0002749 -0.0002476 0.1038846 0.0906227 -0.0097425 0.0312944 0.0452376 -0.0180066 0.1198512 -0.0165605 0.1350737 -0.0859651 unknown
polarizability: 124.5664154|1.2453576|85.6277707|-0.0081783|0.0338588|77.2556934 unknown
InChI: InChI=1S/C7H16S/c1-5-6-8-7(2,3)4/h5-6H2,1-4H3
charge 0 multiplicity 1
24 atoms
S  -0.090736 1.02583 0.005172
C  -1.651696 -0.1240 0.000718
C  -1.666664 -0.996923 1.272857
C  -2.835785 0.869451 0.003797
C  -1.665622 -0.988031 -1.277484
C  1.350094 -0.206507 -0.000414
C  2.677885 0.575644 0.001786
C  3.899896 -0.371162 -0.001873
H  -1.628303 -0.369909 2.180351
H  -2.594548 -1.60201 1.302931
H  -0.812192 -1.696699 1.29741
H  -2.813251 1.519208 -0.889339
H  -2.814196 1.512383 0.901871
H  -3.790736 0.309735 0.001123
H  -0.810789 -1.687217 -1.306348
H  -2.593237 -1.593277 -1.312359
H  -1.626916 -0.354696 -2.18055
H  1.275473 -0.838173 -0.903257
H  1.27658 -0.84498 0.897711
H  2.713491 1.238534 -0.884254
H  2.714104 1.232409 0.892357
H  3.899921 -1.019694 -0.897922
H  4.843815 0.203542 -0.000235
H  3.900513 -1.025759 0.889754
