program: Gaussian 09
title: 000264185
version: EM64L-G09RevD.01
frameworkgroup: C1[X(C13H11BrS)]
method: RPBEPBE
basis: SDD
operation: Freq
keyword: #p
keyword: freq=noraman
keyword: PBEPBE/SDD
title: #p freq=noraman PBEPBE/SDD
converged: NO YES NO NO
title: Mulliken charges:
elementType: Br S C C C C C C C C C C C C C H H H H H H H H H H H
charge: 0.004312 0.212107 0.484206 -0.841424 -0.161858 -0.376439 -0.377857 -0.209642 -0.160891 -0.220791 -0.220735 -0.233880 -0.169968 -0.239789 -0.205792 0.274483 0.273722 0.238166 0.238021 0.264822 0.250871 0.229483 0.229473 0.231722 0.233473 0.254206
chargesum: 0.00000
title: Mulliken charges with hydrogens summed into heavy atoms:
elementType: Br S C C C C C C C C C C C C C
charge: 0.004312 0.212107 0.484206 -0.293218 -0.161858 -0.138273 -0.139836 0.055180 0.089979 0.008692 0.008738 -0.002158 -0.169968 -0.006316 0.048414
polarizability: 2.92364577e+02 1.27550050e+01 1.38457982e+02 2.16981782e-01 3.71560732e-02 1.08333391e+02
1716.lowfreq: -0.0015 -0.0002 0.0008 3.1968 4.0071 6.5697 15.5463 30.3520 45.3472
frequency: 14.2626 30.1497 45.3439 56.6504 124.1100 138.0732 147.5184 188.0576 240.3561 291.7580 341.4958 352.9692 401.9948 408.1211 426.9474 480.6794 520.4873 559.8188 617.0912 638.1322 664.4730 676.1696 702.1976 714.1160 769.7678 777.3789 811.3095 852.2414 875.0978 881.7585 904.4517 927.2152 971.6368 974.4252 977.6953 990.0448 997.8478 1026.8861 1059.4652 1075.0295 1079.9103 1101.0371 1135.0092 1173.8736 1183.4798 1188.3511 1220.6102 1244.7614 1286.9520 1326.7296 1363.0231 1387.1522 1401.5669 1441.6580 1445.0920 1462.5974 1484.3784 1560.6593 1583.1584 1595.4719 1614.5770 3018.4911 3095.3023 3123.8592 3125.7143 3138.2623 3140.5051 3150.5371 3159.4340 3166.7879 3168.3902 3180.1521
redmass: 6.3523 5.1006 7.2198 4.0110 6.5926 10.1586 5.7190 4.4507 5.3107 8.2543 2.3513 5.5465 2.8003 10.3984 3.0128 3.8105 5.3900 5.8797 6.3362 7.0567 4.9648 2.5174 1.6445 8.5590 1.3617 2.1989 3.9519 1.2491 1.4178 1.3823 1.4250 1.4498 1.3306 6.2962 1.3912 5.9573 1.3337 2.1940 5.0264 1.5265 1.7905 1.7517 1.0807 1.0519 1.0887 1.1119 2.3781 1.3437 1.2508 1.2730 6.0300 8.5935 2.9494 2.1955 2.0234 1.1319 2.3425 6.2868 6.7255 6.0964 6.1580 1.0563 1.1092 1.0854 1.0883 1.0920 1.0873 1.0963 1.0925 1.1017 1.0922 1.0979
irintensity: 0.0896 0.3442 0.1060 0.4996 1.1743 0.4264 0.2900 0.0102 0.3422 3.3809 1.0158 0.1235 0.0012 3.4546 7.7951 7.9273 0.1686 11.3805 0.1300 0.7341 25.1627 23.2827 72.3327 101.7999 57.5352 25.5525 7.6910 0.0078 10.5389 2.3415 1.3502 2.6869 0.0349 7.5532 0.0151 0.6463 0.0786 8.0133 29.7148 9.8155 26.8490 1.2997 1.1117 0.0327 0.9824 1.7047 0.7959 23.5248 2.8172 0.2320 9.8680 0.2562 8.4704 8.8124 117.5947 2.7778 14.4008 63.3400 154.1223 1.0316 1.3274 15.9910 7.0930 6.4201 1.5911 14.4507 8.7611 37.0995 0.3974 24.2023 7.5410 7.7949
temp: 298.150 k
press: 1.00000 atm
elementType: 35 16 6 6 6 6 6 6 6 6 6 6 6 6 6 1 1 1 1 1 1 1 1 1 1 1
symmnumber: 1
zpe: 516791.0 jmol-1
zpe.correction: 0.196835 hartree
zpe.thermalcorrener: 0.210707 hartree
zpe.thermalcorrenthalpy: 0.211651 hartree
zpe.thermalcorrgfe: 0.152064 hartree
zpe.sumelectzpe: -912.445816 hartree
zpe.sumelectthermal: -912.431944 hartree
zpe.sumelectthermalent: -912.431000 hartree
zpe.sumelectthermalfe: -912.490587 hartree
dipole: -2.9037 2.2973 0.0060
dipole: 3.7026
quadrupole: -98.0059 -99.5493 -102.9875
quadrupole: 5.3068 0.0381 -0.0127
quadrupole: 2.1750 0.6316 -2.8066 5.3068 0.0381 -0.0127
hfenergy: -912.6426514 hartree
pointgroup: C01 [X(C13H11Br1S1)]
dipole: -1.0024148 -0.7353802 0.7591865 debye
dipolederiv: -0.5437489 -0.2082608 0.2283665 -0.2846791 -0.1971234 0.1621598 0.3011092 0.1576058 -0.2129329 -0.8768371 0.0389594 0.0109493 0.1172166 -0.0503303 -0.0386352 -0.0639413 -0.034381 -0.0475038 0.2349139 -0.0104837 -0.0040194 -0.0821861 -0.0467795 0.0394257 0.0666717 0.0349567 -0.0490237 0.4655276 0.0875806 -0.10228 0.2366333 0.1555419 -0.0375409 -0.2433235 -0.028901 0.1749198 1.2076264 -0.1957716 0.1086768 -0.3823503 0.0162185 -0.0333046 0.2836161 -0.0432538 -0.0180639 -0.092621 -0.0765274 -0.0333534 -0.0137548 -0.033998 0.0861038 0.0025518 0.0931089 -0.0550817 -0.0863038 0.0352169 0.0864729 0.0005411 -0.0650413 0.0881167 0.0210039 0.0827331 -0.0296094 -0.8850366 -0.0325899 0.0798918 -0.1234383 -0.0876049 0.0130383 0.1683584 0.0069052 -0.0992379 -0.4371523 0.0571193 -0.0366055 0.2623982 -0.1354357 -0.0203833 -0.2318306 -0.0074836 -0.1179415 -0.0428019 0.042989 0.0958896 0.0694991 -0.0553909 0.095014 0.1052682 0.1055569 -0.002163 -0.0588173 -0.0861225 -0.0414724 -0.0932628 -0.0034547 0.1144554 -0.0700987 0.1055161 -0.0393081 0.0529628 -0.0576355 0.0500948 -0.0460319 -0.095775 0.0429387 0.0392273 0.0435825 -0.0963422 1.047531 0.3483281 -0.4019338 0.4103924 0.2935674 -0.4064602 -0.4610553 -0.4027357 0.3032937 0.2832848 0.0533048 -0.0762449 -0.0394528 0.0009937 -0.1234324 0.0114637 -0.1293531 -0.009546 -0.3668735 -0.1711308 0.1766183 -0.0954263 -0.2362139 0.1033089 0.1050435 0.1080375 -0.2427969 -0.0242634 -0.0039721 -0.0190136 -0.0968287 0.0436098 0.0008387 0.0087823 0.0168265 -0.1024732 -0.0174419 0.0153376 0.0087028 -0.0158413 -0.1023656 0.0115802 0.0990098 -0.011697 0.037566 0.0642343 0.0922071 0.0434754 0.0874151 0.0236438 -0.0928044 0.0492994 -0.0852794 0.0601092 0.0499428 -0.04292 -0.1004466 -0.0479675 0.0734598 -0.0758964 -0.0954723 -0.083942 0.0248193 0.1222337 0.0367604 -0.0326835 0.0302384 0.0703452 0.0813403 -0.0266792 0.0807411 0.0824136 0.0096938 -0.0735807 0.0788856 -0.0796255 0.0854721 0.0640939 0.0847164 0.0635759 0.0820182 0.0117789 -0.0382892 -0.082482 -0.046602 0.0687998 -0.1041805 -0.1094606 -0.1044896 0.0182963 0.0253778 0.0752657 0.0389439 0.10159 0.0197961 -0.113835 0.0484288 -0.1127411 0.0537292 -0.1256961 0.054353 -0.0411376 0.0583995 0.1139705 -0.0270884 -0.0450202 -0.0268868 0.1163165 0.031469 0.0188274 -0.0100875 0.0389876 0.0163228 0.1314527 -0.0290394 0.1327366 0.0328774 -0.0489832 0.0410349 -0.0252075 0.0341362 0.1277717 0.039694 -0.0186295 0.0392613 0.1356653 unknown
polarizability: 292.5122657|1.1691409|123.5783656|-12.1970176|-14.6437775|123.0653186 unknown
InChI: InChI=1S/C13H11BrS/c14-12-7-4-8-13(9-12)15-10-11-5-2-1-3-6-11/h1-9H,10H2
charge 0 multiplicity 1
26 atoms
Br 5.583912 1.259579 -1.585872
S  0.060076 0.583823 -0.598882
C  -2.466368 -0.210365 0.298748
C  -1.007861 -0.529564 0.529392
C  1.763323 0.037968 -0.186917
C  -3.204785 -0.899104 -0.697751
C  -3.118116 0.784842 1.071463
C  2.809981 0.70094 -0.882806
C  2.07408 -0.973226 0.754978
C  -4.569039 -0.604342 -0.913224
C  -4.48246 1.081059 0.857633
C  -5.211839 0.386467 -0.135262
C  4.141269 0.33511 -0.61822
C  3.423111 -1.3164 0.996271
C  4.477487 -0.668659 0.314528
H  -0.706018 -0.324831 1.569946
H  -0.77558 -1.575542 0.269326
H  -2.707752 -1.664539 -1.305712
H  -2.553829 1.327995 1.839032
H  2.584204 1.483848 -1.613028
H  1.287418 -1.497798 1.303769
H  -5.128877 -1.14521 -1.684112
H  -4.97504 1.849837 1.463084
H  -6.270422 0.615148 -0.301053
H  3.657952 -2.099268 1.725533
H  5.520373 -0.935567 0.502838
