program: Gaussian 09
title: 000264276
version: EM64L-G09RevD.01
frameworkgroup: C1[X(C26H26O4)]
method: RPBEPBE
basis: SDD
operation: Freq
keyword: #pfreq=noraman
keyword: PBEPBE/SDD
title: #p freq=noraman PBEPBE/SDD
converged: YES YES NO NO
title: Mulliken charges:
elementType: O O O O C C C C C C C C C C C C C C C C C C C C C C C C C C H H H H H H H H H H H H H H H H H H H H H H H H H H
charge: -0.330409 -0.314088 -0.211101 -0.241238 -0.385983 -0.354391 -0.582496 -0.356126 0.459721 -0.356503 0.211832 -0.530665 -0.696620 0.377404 -0.334781 -0.418177 0.124792 0.237574 0.160361 0.216851 -0.333650 -0.336230 -0.329848 -0.329429 -0.223290 -0.219127 -0.221743 -0.221990 -0.216458 -0.222015 0.209409 0.218074 0.192041 0.190284 0.222133 0.238713 0.188136 0.190143 0.196101 0.195659 0.311782 0.210338 0.209120 0.215249 0.251891 0.256083 0.270639 0.273023 0.269514 0.266231 0.235198 0.233174 0.234253 0.234586 0.232284 0.233766
chargesum: 0.00000
title: Mulliken charges with hydrogens summed into heavy atoms:
elementType: O O O O C C C C C C C C C C C C C C C C C C C C C C C C C C
charge: -0.330409 -0.314088 -0.211101 -0.241238 0.041500 0.027933 -0.121650 0.022153 0.459721 0.035257 0.211832 -0.218883 -0.061913 0.377404 -0.082890 -0.162094 0.124792 0.237574 0.160361 0.216851 -0.063011 -0.063206 -0.060334 -0.063198 0.011908 0.014047 0.012510 0.012595 0.015826 0.011750
polarizability: 4.83310703e+02 1.92436709e+01 2.48377992e+02 4.78009337e-01 2.29213706e+01 2.08652322e+02
1716.lowfreq: -4.1759 0.0004 0.0005 0.0014 0.9616 7.3577 9.7573 13.3901 17.1636
frequency: 8.3790 13.0937 17.1128 19.0024 29.1673 32.8713 47.7431 50.8910 58.7445 61.4974 77.0539 89.4009 118.3214 120.4108 124.6693 134.8434 144.1530 160.3218 171.7435 198.5542 219.1059 228.9261 257.9053 261.7645 291.6762 324.2485 327.4932 369.5039 394.4215 403.3175 403.5087 415.3737 431.6743 434.5046 441.2273 448.6331 476.1755 491.0431 551.4042 571.1134 613.8727 614.1848 624.7949 654.8057 671.2207 672.9856 674.1580 700.0250 701.4048 716.7647 722.8117 729.5662 740.3085 767.3202 787.6437 793.9379 794.3664 795.1302 809.0892 836.2755 864.2801 865.7495 877.2530 885.8053 919.5139 928.9311 950.7974 955.6893 956.4303 977.1369 990.0517 990.4346 996.7010 997.4228 1000.7107 1009.4283 1009.7891 1010.0642 1013.9718 1017.0720 1032.5930 1039.6507 1063.1885 1074.0914 1078.5342 1085.3606 1087.4539 1112.6571 1115.8857 1136.7806 1153.2538 1174.5301 1174.6154 1182.9697 1184.0395 1191.0813 1228.8476 1229.0815 1234.2799 1239.1116 1244.6110 1269.8269 1279.0033 1283.5410 1289.7145 1294.3507 1315.5478 1316.3379 1324.8178 1349.4752 1355.2228 1380.2176 1386.5385 1390.1080 1390.6238 1410.7365 1438.1411 1438.2915 1462.7211 1464.4535 1470.3049 1473.5206 1475.2246 1476.7332 1477.8442 1480.2657 1486.3641 1492.8497 1584.2414 1586.6655 1596.2237 1603.1794 1610.7827 1611.2653 1625.6602 1641.4319 2949.9552 2954.3730 2966.8177 2970.8558 2976.4937 2987.2488 2995.7171 3002.9592 3023.3073 3035.8429 3059.3225 3067.4172 3069.8169 3131.4064 3131.4774 3143.7429 3144.1953 3155.6059 3156.4561 3157.8415 3167.7320 3168.7345 3178.8107 3180.9486 3183.5037 3199.1210
redmass: 4.0960 5.1904 5.6598 4.9446 4.6662 1.6394 5.4863 3.7956 6.0952 3.6436 7.9627 4.8675 1.7653 3.8727 4.2759 3.4413 3.8501 5.1396 4.3549 5.0140 1.1522 4.5215 3.7190 5.8296 4.7134 9.2815 4.8266 6.1123 3.4509 2.8343 2.8272 3.9379 4.1375 5.2118 4.0314 4.7796 3.7454 4.0683 8.7882 4.7827 6.4406 6.4364 4.7312 6.5971 5.2190 6.1591 5.4551 1.6350 1.6186 4.7270 1.0790 4.9921 1.1997 3.0632 2.4466 1.7738 2.0129 2.1485 6.7869 1.9164 1.2450 1.2437 1.2741 1.9264 2.2769 1.9972 1.3654 1.4184 1.4157 1.2369 6.3687 6.2886 1.3855 1.3864 6.9385 1.3319 1.3614 3.6291 3.6300 3.3063 2.1063 2.3213 2.7038 1.9400 2.2019 1.5862 1.6455 1.8101 2.0911 2.0105 1.8161 1.0560 1.0573 1.1403 1.1391 1.6664 2.7390 1.3196 3.3674 1.8249 2.7895 1.3240 1.1952 1.1126 1.2733 1.1466 1.3177 1.3152 1.4084 1.4918 1.6761 8.8323 1.2193 9.9753 10.0033 3.8137 2.2421 2.2518 1.0714 1.0861 1.4172 1.5233 1.0506 2.2270 1.4946 1.5485 1.0982 1.1138 6.7199 6.4937 7.2311 7.6759 6.0811 6.1162 10.8459 11.8398 1.0590 1.0590 1.0590 1.0367 1.0596 1.0973 1.0595 1.1008 1.1026 1.1035 1.1040 1.1008 1.0992 1.0856 1.0856 1.0891 1.0893 1.0941 1.0941 1.0886 1.0984 1.0986 1.0976 1.0973 1.0966 1.0925
irintensity: 0.0036 1.0416 0.4281 1.0640 0.0979 0.1177 0.2535 0.0519 0.4415 0.5074 1.3191 0.3728 0.0495 0.4006 0.0183 0.1963 0.1272 0.1362 0.5906 1.5648 0.0466 4.0909 1.4427 1.8085 6.8925 6.3637 2.7258 4.8039 0.3717 0.0114 0.0039 1.9864 1.1696 1.1199 1.1394 1.8893 6.3217 1.6121 0.3643 1.6886 1.0514 1.1462 1.1101 33.5291 16.5661 15.7136 11.1909 81.4135 88.1772 0.9671 9.9131 1.5532 0.0769 2.2528 2.0146 15.6724 19.6301 21.6309 6.2877 47.0239 0.0034 0.0923 1.0827 3.9231 16.9462 18.4558 0.3549 4.5817 4.1117 1.0344 36.3091 3.1732 0.0511 0.8126 407.7795 0.4313 0.4988 5.6649 99.5272 148.7339 54.3782 250.5218 1.3343 7.6549 0.1220 10.8692 17.4016 61.1538 101.4463 449.6210 220.4549 0.0715 0.0913 52.1073 15.6515 7.8519 8.3262 12.0034 688.3298 10.8027 4.2448 11.9736 1.7071 2.6412 5.2019 1.6029 0.6057 0.8920 1.7102 0.6524 1.2535 8.9485 11.1663 2.9138 2.9820 20.9213 20.4035 11.4827 0.2941 3.1308 50.6876 73.2368 7.2954 5.8416 10.0470 64.1436 22.4661 30.0085 26.0499 18.5895 7.8258 17.6963 23.5322 4.7319 142.3090 154.1939 0.9764 13.6267 65.6155 35.9085 37.9671 0.4137 38.9766 1.3719 8.2273 38.8367 56.1211 103.6839 55.5806 0.1824 0.0812 9.6133 10.5038 15.9300 17.5590 6.5493 27.2967 25.5255 3.6021 6.4848 8.0507 6.3664
temp: 298.150 k
press: 1.00000 atm
elementType: 8 8 8 8 6 6 6 6 6 6 6 6 6 6 6 6 6 6 6 6 6 6 6 6 6 6 6 6 6 6 1 1 1 1 1 1 1 1 1 1 1 1 1 1 1 1 1 1 1 1 1 1 1 1 1 1
symmnumber: 1
zpe: 1183187.1 jmol-1
zpe.correction: 0.450652 hartree
zpe.thermalcorrener: 0.479326 hartree
zpe.thermalcorrenthalpy: 0.480270 hartree
zpe.thermalcorrgfe: 0.384163 hartree
zpe.sumelectzpe: -1305.131903 hartree
zpe.sumelectthermal: -1305.103229 hartree
zpe.sumelectthermalent: -1305.102284 hartree
zpe.sumelectthermalfe: -1305.198392 hartree
dipole: -0.4888 -0.6735 -2.3926
dipole: 2.5332
quadrupole: -122.0669 -173.8639 -178.0061
quadrupole: 1.7285 -1.8874 8.0060
quadrupole: 35.9121 -15.8849 -20.0271 1.7285 -1.8874 8.0060
hfenergy: -1305.5825549 hartree
pointgroup: C01 [X(C26H26O4)]
dipole: 0.2112332 0.2434182 -0.9430785 debye
polarizability: 484.6690462|-5.9570691|246.9583552|-5.1987594|-22.6893462|208.7136164 unknown
InChI: InChI=1S/C26H26O4/c1-2-3-4-7-16-22-19-23(29-25(27)20-12-8-5-9-13-20)17-18-24(22)30-26(28)21-14-10-6-11-15-21/h5-6,8-15,17-19H,2-4,7,16H2,1H3
charge 0 multiplicity 1
56 atoms
O  2.050994 0.986396 -0.432161
O  -3.578756 0.81175 -0.14655
O  2.36681 1.800098 1.745704
O  -4.053441 -1.15684 1.058356
C  1.467343 -2.264054 0.002725
C  2.359686 -3.350945 0.64062
C  0.889699 -1.276546 1.055427
C  2.9249 -4.353252 -0.39099
C  0.044786 -0.179554 0.431012
C  3.829337 -5.435678 0.241026
C  0.626025 0.90979 -0.261976
C  -1.370635 -0.24449 0.491189
C  4.386546 -6.435952 -0.794969
C  -2.152687 0.75499 -0.132647
C  -0.149014 1.906005 -0.884086
C  -1.552531 1.832404 -0.821637
C  2.847647 1.454563 0.645406
C  4.29153 1.471114 0.275741
C  -4.440411 -0.136282 0.442409
C  -5.866087 0.244344 0.22837
C  5.220052 1.918066 1.25259
C  4.750634 1.05863 -1.002731
C  -6.861896 -0.612409 0.76831
C  -6.248402 1.411239 -0.484408
C  6.596707 1.952246 0.952823
C  6.129745 1.094961 -1.29727
C  7.053983 1.540653 -0.322332
C  -8.226376 -0.305151 0.596458
C  -7.615672 1.713909 -0.653599
C  -8.60616 0.858432 -0.114908
H  0.629509 -2.740856 -0.544656
H  2.053191 -1.694503 -0.745219
H  3.200509 -2.864477 1.17837
H  1.777584 -3.903686 1.407844
H  0.273649 -1.843014 1.778627
H  1.725408 -0.834908 1.630232
H  3.501509 -3.800271 -1.162027
H  2.084701 -4.84494 -0.924665
H  4.670028 -4.943393 0.77148
H  3.253857 -5.985162 1.014025
H  -1.852838 -1.068283 1.018671
H  3.565822 -6.961315 -1.319123
H  4.994219 -5.917048 -1.560378
H  5.026365 -7.200738 -0.317191
H  0.349459 2.727115 -1.407448
H  -2.185422 2.590271 -1.291183
H  4.842259 2.232137 2.231328
H  4.025711 0.718918 -1.747205
H  -6.543977 -1.506387 1.314815
H  -5.474635 2.064406 -0.89568
H  7.311937 2.29759 1.706903
H  6.485141 0.777268 -2.283401
H  8.124507 1.567383 -0.554783
H  -8.992172 -0.967358 1.014178
H  -7.910375 2.614152 -1.203518
H  -9.667302 1.097061 -0.248204
