program: Gaussian 09
title: 000264202
version: EM64L-G09RevD.01
frameworkgroup: C1[X(C16H19NO2S2)]
method: RPBEPBE
basis: SDD
operation: Freq
keyword: #p
keyword: freq=noraman
keyword: PBEPBE/SDD
title: #p freq=noraman PBEPBE/SDD
converged: YES YES NO NO
title: Mulliken charges:
elementType: S S O O N C C C C C C C C C C C C C C C C H H H H H H H H H H H H H H H H H H H
charge: 0.484969 0.901939 -0.536172 -0.575117 -0.607621 -0.596374 -0.320628 -0.111199 -0.035364 -0.664710 -0.239499 -0.246839 -0.170933 -0.259270 0.453553 -0.370725 -0.366548 -0.230549 -0.216246 -0.218181 -0.803200 0.327434 0.272669 0.218270 0.218702 0.224823 0.226409 0.214753 0.273299 0.284820 0.321235 0.256998 0.237709 0.239239 0.239889 0.239310 0.237497 0.229359 0.238203 0.228097
chargesum: 0.00000
title: Mulliken charges with hydrogens summed into heavy atoms:
elementType: S S O O N C C C C C C C C C C C C C C C C
charge: 0.484969 0.901939 -0.536172 -0.575117 -0.607621 0.003729 0.116344 -0.111199 -0.035364 0.001276 0.033799 0.037981 0.150301 -0.002272 0.453553 -0.133016 -0.127309 0.009340 0.023064 0.019316 -0.107542
polarizability: 3.23656054e+02 -1.14844057e+01 2.25768672e+02 9.54139816e+00 -3.89293958e-02 1.83084524e+02
1716.lowfreq: -7.6888 -3.1745 -0.0022 -0.0022 -0.0010 1.7493 11.6737 25.4515 27.4442
frequency: 11.3799 25.3733 27.3148 35.8043 36.6478 48.5005 56.4513 81.0040 84.9288 111.8453 131.2348 140.5150 146.3605 147.9797 212.2829 220.8460 232.8529 237.2063 259.6587 288.5420 304.4948 327.7897 349.2398 373.9313 388.8706 394.2859 407.4060 407.6726 466.2384 485.7223 505.6007 572.7035 592.7972 606.6892 619.8737 623.1714 630.8893 667.9112 695.9320 712.1872 748.8271 758.8077 773.2564 794.0600 827.3840 850.6459 854.5275 863.8248 903.3383 906.9503 934.3989 960.7476 980.9480 982.1311 984.8673 988.6116 998.1808 1005.4447 1013.6843 1035.7771 1048.1129 1055.2607 1058.1282 1073.3906 1077.0426 1105.8896 1115.2396 1173.5080 1179.2960 1181.5571 1215.9905 1217.0439 1253.2116 1285.7314 1293.2391 1303.7878 1331.1684 1381.1457 1381.8418 1390.5553 1392.5439 1397.8503 1431.7485 1437.0374 1458.2687 1471.2839 1474.2435 1474.4065 1476.3840 1477.2601 1486.7615 1585.0028 1596.1864 1596.3637 1598.0144 2978.1821 2984.3781 2989.2127 3017.0933 3041.9568 3060.3390 3083.1142 3088.1324 3089.6968 3112.9556 3131.4110 3133.1832 3133.9776 3140.1873 3147.0360 3158.7363 3160.3473 3163.3470 3171.7617
redmass: 5.1385 4.7042 4.0966 2.9240 1.0997 6.7954 3.8241 1.7799 3.6658 5.1535 5.8207 5.1664 4.2310 8.3928 4.8429 5.4669 1.3571 2.4346 6.2851 5.1913 4.8771 5.0344 4.5504 8.6712 5.1724 9.8438 2.8700 2.9167 6.4720 3.6828 3.5186 10.4029 6.5785 6.7807 8.5364 6.9628 6.6665 6.8332 2.4431 3.2893 1.1431 1.3248 5.7193 9.7337 1.3782 1.2493 1.2377 1.2061 2.4736 5.0246 1.3506 1.3162 1.3876 4.7837 1.4477 1.4010 5.1550 1.3431 3.5584 3.0309 1.5871 2.1742 2.5088 1.2509 1.5865 2.1154 1.2807 1.0644 1.1178 1.1451 1.3857 2.9421 1.1922 1.1025 1.2668 1.3084 1.3843 5.9649 9.7808 3.0854 1.1924 1.2234 2.1230 1.1115 2.0423 1.0977 2.3146 1.0762 1.0519 1.0407 1.0851 5.9122 6.6846 6.9626 6.1045 1.0388 1.0351 1.0594 1.0583 1.1023 1.0948 1.1004 1.1011 1.1000 1.1088 1.0891 1.0893 1.0857 1.0888 1.0927 1.0968 1.0951 1.0965 1.1016
irintensity: 2.3714 0.7280 0.6204 0.4603 0.5807 0.5322 0.2197 0.1563 0.8336 0.2411 2.1108 3.1260 0.9314 7.5136 5.0093 8.2781 0.5379 0.8826 1.3541 15.8639 1.0761 5.4290 8.3777 14.0167 0.9045 12.9612 0.1278 0.3133 61.4240 19.6660 43.0038 19.1143 11.1123 24.2077 151.3908 1.1887 59.3389 9.7200 30.3946 1.9382 29.1994 52.4636 39.8312 85.5192 28.0128 1.4424 0.2253 0.3895 63.6433 52.4040 2.8638 0.9541 0.1734 3.8486 1.4943 1.5869 5.7650 1.0829 16.3744 9.2321 17.7641 6.2912 27.5042 8.1051 6.5196 18.1741 7.7824 4.3029 18.7374 7.5870 4.2818 4.6533 8.3966 1.3420 2.3312 4.5547 4.5370 0.2159 2.2435 8.6484 9.3849 13.9705 10.8424 12.3879 45.0759 15.6552 24.1399 12.2195 4.6072 14.1373 10.3230 11.5033 1.6967 0.2973 9.7261 32.5917 35.5818 18.9121 7.5491 7.3877 22.5319 39.6672 36.4325 15.8471 8.8053 17.2196 12.3318 1.4972 9.0699 2.0262 13.9863 2.2891 11.1026 30.4524
temp: 298.150 k
press: 1.00000 atm
elementType: 16 16 8 8 7 6 6 6 6 6 6 6 6 6 6 6 6 6 6 6 6 1 1 1 1 1 1 1 1 1 1 1 1 1 1 1 1 1 1 1
symmnumber: 1
zpe: 814035.4 jmol-1
zpe.correction: 0.310050 hartree
zpe.thermalcorrener: 0.333110 hartree
zpe.thermalcorrenthalpy: 0.334054 hartree
zpe.thermalcorrgfe: 0.253303 hartree
zpe.sumelectzpe: -1620.622209 hartree
zpe.sumelectthermal: -1620.599149 hartree
zpe.sumelectthermalent: -1620.598205 hartree
zpe.sumelectthermalfe: -1620.678956 hartree
dipole: 4.2476 3.5354 -5.8277
dipole: 8.0314
quadrupole: -98.5475 -135.7146 -148.6569
quadrupole: -8.9365 9.0652 5.7821
quadrupole: 29.0922 -8.0749 -21.0173 -8.9365 9.0652 5.7821
hfenergy: -1620.9322589 hartree
pointgroup: C01 [X(C16H19N1O2S2)]
dipole: 1.6889289 -1.5776657 2.1547421 debye
polarizability: 323.496733|12.3600303|225.4939378|-9.6064572|3.4431379|183.518579 unknown
InChI: InChI=1S/C16H19NO2S2/c1-3-13-20(15-7-5-4-6-8-15)17-21(18,19)16-11-9-14(2)10-12-16/h4-12H,3,13H2,1-2H3
charge 0 multiplicity 1
40 atoms
S  1.785078 0.675894 -0.829287
S  -1.099166 1.104819 -1.227116
O  -1.295559 0.990572 -2.845457
O  -0.85663 2.607464 -0.589334
N  0.135582 -0.073748 -0.499463
C  2.051125 1.718576 0.790286
C  3.427461 2.385174 0.855363
C  2.806294 -0.842231 -0.45324
C  -2.610353 0.328571 -0.413963
C  3.535832 3.269136 2.123093
C  -2.962587 0.736563 0.881725
C  -3.359079 -0.595235 -1.159087
C  2.182342 -1.957822 0.135574
C  4.172648 -0.827328 -0.798321
C  -4.908257 -0.774896 0.752519
C  -4.124141 0.176583 1.45796
C  -4.514877 -1.144497 -0.561017
C  2.972042 -3.098639 0.405399
C  4.948415 -1.977463 -0.519948
C  4.350078 -3.107973 0.083456
C  -6.137678 -1.392822 1.394656
H  1.210993 2.431248 0.705131
H  1.861657 1.000873 1.605748
H  4.227538 1.620279 0.872863
H  3.586148 3.013336 -0.042302
H  4.52706 3.754272 2.172531
H  2.767057 4.062527 2.119867
H  3.404342 2.669199 3.042165
H  -2.362293 1.488056 1.404298
H  -3.055926 -0.848628 -2.180125
H  1.106793 -1.923286 0.340895
H  4.623211 0.042288 -1.28866
H  -4.426863 0.483956 2.465829
H  -5.120566 -1.864844 -1.123249
H  2.507293 -3.980211 0.85938
H  6.010993 -1.98904 -0.784211
H  4.953784 -3.997965 0.291707
H  -6.900904 -1.653683 0.640889
H  -5.875204 -2.324708 1.932392
H  -6.599382 -0.709466 2.128453
