program: Gaussian 09
title: 000256161
version: EM64L-G09RevD.01
frameworkgroup: C1[X(C11H12N4O2S)]
method: RPBEPBE
basis: SDD
operation: Freq
keyword: #p
keyword: freq=noraman
keyword: PBEPBE/SDD
title: #p freq=noraman PBEPBE/SDD
converged: YES YES NO NO
title: Mulliken charges:
elementType: S O O N N N N C C C C C C C C C C C H H H H H H H H H H H H
charge: 0.314836 -0.288911 -0.290802 -0.151402 -0.047834 -0.022903 -0.016369 0.005274 -0.360882 -0.419670 0.039387 -0.359329 -0.707777 0.131105 0.108938 -0.219987 -0.342834 -0.378978 0.278412 0.215992 0.231655 0.266464 0.218458 0.279479 0.215353 0.225815 0.267553 0.286661 0.272675 0.249617
chargesum: 0.00000
title: Mulliken charges with hydrogens summed into heavy atoms:
elementType: S O O N N N N C C C C C C C C C C C
charge: 0.314836 -0.288911 -0.290802 -0.151402 -0.047834 -0.022903 -0.016369 0.283686 0.086766 0.065252 0.318867 0.081839 -0.153562 0.131105 0.108938 0.052689 -0.342834 -0.129361
polarizability: 2.62328288e+02 8.80443498e+00 1.50669327e+02 2.00962271e+00 1.83898769e+01 1.09608382e+02
1716.lowfreq: -8.5881 -2.1128 -0.0015 -0.0008 -0.0007 2.8896 16.6280 22.8975 37.5635
frequency: 15.1799 22.5555 37.5064 45.7613 61.6224 73.8257 112.8544 150.6642 167.3382 193.6105 235.6411 243.7651 259.8179 297.7914 341.4010 369.5545 395.0953 414.2366 417.4416 529.8496 539.9572 569.1615 626.2792 640.6124 659.1803 669.2763 697.0617 727.6358 757.0419 789.7564 799.0487 807.5217 817.5526 832.9331 872.2094 881.2009 889.9281 907.3624 921.7214 944.1536 1021.9619 1028.1615 1060.9786 1084.2181 1101.2696 1106.9176 1110.9605 1124.2403 1126.0420 1143.9946 1180.1871 1198.4810 1217.3861 1233.2130 1236.3621 1241.9553 1269.1142 1290.4325 1300.7440 1331.0513 1346.1618 1370.6043 1374.0602 1393.2194 1400.9522 1405.4282 1435.4168 1463.7492 1478.1378 1483.7138 1517.7689 1545.1603 3026.4865 3041.2509 3060.6949 3068.7507 3089.5795 3116.6702 3121.5164 3131.6665 3168.2674 3171.8218 3178.4172 3228.1847
redmass: 3.5319 7.0665 5.8410 6.6459 4.2884 4.4473 6.0059 4.9286 6.8580 6.7869 3.8168 3.7448 4.6781 6.6015 3.6582 2.3817 5.0340 3.1619 4.9745 4.8242 4.9790 8.3435 7.3661 4.8139 7.7232 4.7449 5.9765 8.0740 6.1190 5.1940 4.2226 3.1510 8.7064 1.6577 2.1626 1.3270 1.6820 5.3944 1.4303 2.2988 1.1788 1.2992 2.1634 1.9033 3.2717 1.3206 1.4457 1.4938 1.4959 3.2475 2.8176 1.7869 1.3005 1.6030 1.5535 1.8638 1.2153 6.9882 4.8794 2.5454 1.4006 4.6223 1.5730 1.6511 1.9746 1.2793 2.3329 1.4207 1.1851 1.2318 8.4638 8.9924 1.0598 1.0575 1.0529 1.0539 1.1034 1.1008 1.0932 1.0974 1.1180 1.0923 1.1183 1.0985
irintensity: 0.6960 0.5117 2.1998 1.8546 7.6177 5.0161 1.2545 8.4936 2.9386 3.6415 1.6289 2.8622 1.0315 7.0075 1.0429 4.4548 7.9554 3.9271 5.8010 2.3961 1.8719 15.9145 1.7876 18.9672 0.6675 10.3984 22.5832 18.8618 40.1130 9.2693 16.1233 26.0282 39.9573 11.8136 3.2648 10.9297 12.0739 70.4506 11.5359 16.6529 1.3674 0.1614 13.8155 13.4267 6.7241 3.8875 9.1279 12.3488 7.6222 50.6242 20.7836 35.8688 2.3157 10.5918 28.5795 43.3797 16.1753 73.4835 52.7366 15.2790 21.7180 13.8150 0.3746 43.1075 0.6108 26.7091 37.7142 42.4466 1.1402 12.4712 212.9661 116.7992 21.0841 12.2194 36.6330 19.9507 3.7738 0.6582 4.6070 3.5056 28.0273 13.2083 21.8519 0.0318
temp: 298.150 k
press: 1.00000 atm
elementType: 16 8 8 7 7 7 7 6 6 6 6 6 6 6 6 6 6 6 1 1 1 1 1 1 1 1 1 1 1 1
symmnumber: 1
zpe: 584737.4 jmol-1
zpe.correction: 0.222715 hartree
zpe.thermalcorrener: 0.239309 hartree
zpe.thermalcorrenthalpy: 0.240253 hartree
zpe.thermalcorrgfe: 0.174547 hartree
zpe.sumelectzpe: -1192.459149 hartree
zpe.sumelectthermal: -1192.442555 hartree
zpe.sumelectthermalent: -1192.441610 hartree
zpe.sumelectthermalfe: -1192.507316 hartree
dipole: 1.0431 -1.1151 -1.3723
dipole: 2.0530
quadrupole: -110.6659 -113.3879 -113.7582
quadrupole: 19.7665 16.3927 -3.1698
quadrupole: 1.9381 -0.7839 -1.1542 19.7665 16.3927 -3.1698
hfenergy: -1192.6818633 hartree
pointgroup: C01 [X(C11H12N4O2S1)]
dipole: -0.395088 -0.6815 0.1784309 debye
polarizability: 262.3470839|-6.0844325|153.3518983|-7.1713212|14.5268604|106.9070146 unknown
InChI: InChI=1S/C11H12N4O2S/c1(7-2-16-7)15-6-14-9-10(15)12-5-13-11(9)18-4-8-3-17-8/h5-8H,1-4H2
charge 0 multiplicity 1
30 atoms
S  2.583983 1.257849 0.868828
O  -5.623841 -0.556282 -0.955903
O  5.097485 0.889753 -1.574287
N  -2.399644 0.427956 0.829058
N  -0.682631 1.927107 1.154503
N  -1.077054 -1.588184 0.261509
N  1.333458 -1.142797 0.300511
C  -4.139457 -0.442047 -0.720393
C  -4.828375 0.569334 -1.581373
C  -3.762769 -0.123717 0.722506
C  4.283669 -0.190233 -0.897027
C  5.681752 -0.483828 -1.357437
C  3.988475 0.015529 0.56712
C  -1.216445 -0.277025 0.602384
C  -0.160312 0.667398 0.810529
C  -2.014411 1.740754 1.15164
C  1.158037 0.167856 0.639429
C  0.232904 -1.945264 0.133768
H  -3.545547 -1.232645 -1.195203
H  -5.04897 1.565255 -1.175595
H  -4.724101 0.509664 -2.670666
H  -3.819793 -1.046135 1.326975
H  -4.473502 0.609444 1.140965
H  3.446943 -0.556533 -1.502775
H  6.49314 -0.525768 -0.618735
H  5.835334 -1.075955 -2.267876
H  4.852876 0.447267 1.097445
H  3.674368 -0.931831 1.034101
H  -2.747512 2.511713 1.382304
H  0.433238 -2.985935 -0.135606
