program: Gaussian 09
title: 000003917
version: EM64L-G09RevD.01
frameworkgroup: C1[X(C9H13NO3)]
method: RPBEPBE
basis: SDD
operation: Freq
keyword: #p
keyword: freq=noraman
keyword: PBEPBE/SDD
title: #p freq=noraman PBEPBE/SDD
converged: YES YES NO NO
title: Mulliken charges:
elementType: O O O N C C C C C C C C C H H H H H H H H H H H H H
charge: -0.470022 -0.492917 -0.429263 -0.548477 -0.254917 -0.114003 0.519739 -0.720785 -0.525246 -0.460700 0.187612 -0.313544 0.131633 0.193829 0.228024 0.244180 0.236956 0.193974 0.259819 0.235787 0.291744 0.251286 0.251567 0.344818 0.374798 0.384109
chargesum: 0.00000
title: Mulliken charges with hydrogens summed into heavy atoms:
elementType: O O O N C C C C C C C C C
charge: -0.125203 -0.118120 -0.045154 -0.005447 -0.061088 0.114021 0.519739 -0.045675 -0.265428 -0.224913 0.187612 -0.061978 0.131633
polarizability: 1.64917364e+02 1.62044329e+00 1.13711271e+02 6.56310142e+00 -1.00882246e+01 7.86136019e+01
1716.lowfreq: -6.8989 -2.6710 -0.0012 -0.0010 -0.0007 6.5422 45.6607 65.3063 74.2598
frequency: 45.4700 65.2851 74.2522 159.3908 171.0399 223.0690 237.5265 271.5402 278.7082 284.6982 295.9524 302.0088 334.1749 355.8493 397.8928 418.1007 448.6640 460.3340 488.1950 514.2390 557.0513 588.7345 623.6109 705.7608 721.1607 743.2467 783.3441 815.0318 841.4096 869.9978 917.6689 934.1802 943.6388 964.3488 1004.1158 1068.7353 1081.1524 1126.8634 1147.7551 1156.9374 1179.1250 1195.2215 1226.2675 1237.4896 1258.7428 1303.0561 1306.7081 1337.3712 1340.9954 1362.1146 1388.8729 1414.9416 1433.4902 1472.2003 1479.6808 1515.6504 1612.7081 1621.8481 1642.6097 2935.9761 2974.3521 2985.8468 3072.6824 3105.1005 3123.7344 3130.6575 3171.8114 3429.0525 3525.8126 3556.9641 3568.1507 3621.9543
redmass: 4.2773 3.7653 4.1069 5.7329 5.4280 3.4192 1.1608 1.3191 4.7283 1.8864 1.9149 1.9017 1.3807 2.3163 3.1518 3.5722 3.2146 3.2081 1.1134 4.0842 5.8556 6.3865 4.5281 1.4842 3.4595 5.9562 5.0361 1.4412 1.5647 1.7181 2.5397 1.6532 2.0605 3.2164 1.5743 2.0443 1.8489 1.3860 1.5569 1.9323 1.3444 1.4059 2.1665 1.5320 1.5673 1.4282 1.9386 1.6300 1.4790 1.2748 1.2666 3.5104 4.4439 1.0461 1.0504 3.2622 6.4636 7.2100 1.0912 1.0835 1.0477 1.0778 1.0933 1.1003 1.0912 1.0896 1.0951 1.0446 1.0648 1.0962 1.0661 1.0666
irintensity: 2.9748 0.1908 0.9336 5.4698 1.0299 1.5520 0.8067 131.6679 7.1418 69.9985 61.0162 11.9564 80.1780 41.0495 11.8429 2.0441 15.8388 27.9638 117.0827 25.1163 8.4342 23.4605 12.7960 331.7763 18.3298 43.7377 14.4861 44.7558 16.1842 22.3365 7.7552 11.6473 17.3849 34.8347 11.8931 109.4505 95.6808 10.6798 14.0046 26.7591 209.8600 29.3026 106.3525 21.6913 66.9317 26.1106 24.9730 22.7448 4.6101 2.1155 21.5559 29.2198 43.6645 7.8366 5.1419 102.8506 17.8626 14.0366 48.8077 37.6815 12.1996 56.8019 37.0105 27.1669 7.2631 8.6744 6.7225 3.0294 89.7520 3.5521 4.6142 50.8340
temp: 298.150 k
press: 1.00000 atm
elementType: 8 8 8 7 6 6 6 6 6 6 6 6 6 1 1 1 1 1 1 1 1 1 1 1 1 1
symmnumber: 1
zpe: 549997.0 jmol-1
zpe.correction: 0.209483 hartree
zpe.thermalcorrener: 0.223113 hartree
zpe.thermalcorrenthalpy: 0.224057 hartree
zpe.thermalcorrgfe: 0.169885 hartree
zpe.sumelectzpe: -630.167515 hartree
zpe.sumelectthermal: -630.153885 hartree
zpe.sumelectthermalent: -630.152941 hartree
zpe.sumelectthermalfe: -630.207112 hartree
dipole: 0.0782 -1.0299 -0.9802
dipole: 1.4239
quadrupole: -88.0406 -69.4238 -76.6653
quadrupole: -11.8679 7.5599 -3.3231
quadrupole: -9.9973 8.6194 1.3779 -11.8679 7.5599 -3.3231
hfenergy: -630.3769976 hartree
pointgroup: C01 [X(C9H13N1O3)]
dipole: -0.015751 0.1973767 -0.5240431 debye
dipolederiv: -0.5878455 0.0998972 0.2173854 0.0766241 -0.4126995 0.2091022 0.3234054 0.184162 -0.7154223 -0.52713 0.5352516 -0.049905 0.6547852 -1.0597398 -0.0078749 -0.0502055 0.0040757 -0.4293825 -1.5640911 0.1060947 0.1414549 0.1234877 -0.1364273 -0.0482164 0.173892 -0.0470489 -0.4277984 -1.0487574 -0.2117387 -0.1099108 -0.3970776 -0.3252628 -0.1514221 -0.2349079 -0.1241383 -0.490973 0.2124007 -0.1125952 -0.1026862 -0.2159448 0.3179876 -0.1596135 -0.364726 -0.1458646 0.5345763 0.7690605 0.0942591 0.0043652 0.117008 0.2020434 0.0673501 0.2369987 0.0591511 0.2901751 0.1037723 -0.0242031 0.0971697 0.1014004 -0.0715742 0.0170549 -0.0984097 -0.0068174 -0.1739346 0.0020748 -0.0362849 0.0051992 -0.0933584 0.0745505 0.052549 -0.003335 0.0730947 -0.0965964 -0.1276437 0.1264454 -0.0452119 0.0393117 -0.0733189 0.0008208 -0.0369625 -0.0194278 -0.1619119 -0.0867119 0.0761976 -0.0525959 -0.0942652 0.0310366 -0.0273136 0.034746 -0.0538158 -0.1726744 0.1041135 -0.3843295 0.0303787 -0.8272187 0.9583643 -0.0046877 0.0946494 -0.0481081 0.0321358 -0.1006276 -0.0516414 0.0148356 0.2037553 0.0801578 -0.0586915 -0.0322024 -0.0117792 -0.1383231 1.3920529 -0.1733483 -0.1803298 0.0992161 -0.1444992 0.0267618 -0.2305873 0.0478696 0.0753594 -0.0286193 0.0440188 0.0205967 0.0982725 -0.1930279 0.0092722 0.0070097 0.0139604 -0.0110222 -0.0440314 0.0784295 0.0120613 0.1039655 -0.1196811 -0.0241025 -0.0240485 0.0051098 0.0300991 0.0196532 -0.0344365 -0.1227803 -0.054596 0.0554594 -0.0811914 -0.1056182 -0.0504175 -0.0593374 -0.1086319 -0.022876 0.0895231 -0.0103876 0.0633982 0.0221519 0.0940391 0.0071595 0.0951894 0.0449504 0.0874354 0.0076308 0.0999565 -0.1359275 0.004983 0.0551432 -0.0698566 0.0579893 0.0886816 -0.0590414 0.0218409 -0.0533039 -0.0420533 0.0269947 0.0055035 0.0259351 0.1540374 0.0315609 0.1089434 0.0152963 0.0835116 -0.0405362 0.0095606 0.0136463 0.0089442 0.1433711 0.2840434 0.0660646 0.0489449 0.1666665 0.2676341 0.0630784 0.1172275 0.1089312 0.0813042 0.2246447 0.0230263 0.061315 0.1623686 -0.0050658 0.0340294 0.1419747 -0.0010852 0.2497927 0.0380566 -0.0721179 0.0268051 -0.0775144 -0.0081305 0.0289133 0.0277281 0.0292193 0.1602093 0.2512111 -0.0849442 -0.1948596 -0.112013 0.2283955 -0.0601709 -0.1876399 -0.0380357 0.1975403 0.1942152 -0.1666495 0.0475561 -0.1377541 0.3198952 0.020837 0.0468166 0.0233962 0.3888344 0.4635982 -0.0118571 -0.0040794 -0.056896 0.1690212 0.0298249 -0.0041373 0.0253863 0.3867624 unknown
polarizability: 164.963805|-2.9637215|115.1056257|-5.4584632|-7.344124|77.1728057 unknown
InChI: InChI=1S/C9H13NO3/c1-5(10)9(13)6-2-3-7(11)8(12)4-6/h2-5,9,11-13H,10H2,1H3
charge 0 multiplicity 1
26 atoms
O  2.188334 0.5498 -1.726377
O  -2.59558 2.111036 -0.09415
O  -3.860029 -0.220585 0.388356
N  4.080204 0.47979 0.29346
C  1.821558 -0.284675 -0.553368
C  2.651213 0.334821 0.622892
C  0.320683 -0.280266 -0.326439
C  2.496612 -0.485241 1.915484
C  -0.391386 0.950961 -0.343122
C  -0.389846 -1.480167 -0.076894
C  -1.773604 0.958691 -0.101228
C  -1.782545 -1.468157 0.16619
C  -2.481739 -0.247443 0.156339
H  2.169765 -1.330045 -0.71397
H  2.239807 1.351097 0.789151
H  3.058518 0.002299 2.730129
H  1.438917 -0.575713 2.214639
H  2.903431 -1.508421 1.785305
H  0.149219 1.881003 -0.56015
H  0.148027 -2.435439 -0.070006
H  4.218411 0.926947 -0.620646
H  4.598803 -0.404645 0.361108
H  -2.339164 -2.38993 0.358342
H  1.626503 0.275919 -2.494609
H  -2.075131 2.937044 -0.237352
H  -4.17238 0.721519 0.339718
