program: Gaussian 09
title: 000256159
version: EM64L-G09RevD.01
frameworkgroup: C1[X(C10H11N7O2S2)]
method: RPBEPBE
basis: SDD
operation: Freq
keyword: #p
keyword: freq=noraman
keyword: PBEPBE/SDD
title: #p freq=noraman PBEPBE/SDD
converged: YES YES NO NO
title: Mulliken charges:
elementType: S S O O N N N N N N N C C C C C C C C C C H H H H H H H H H H H
charge: 0.949254 0.364826 -0.538304 -0.540271 -0.718592 -0.044253 0.010585 -0.040320 -0.290288 -0.631055 -0.632157 -0.042343 -0.214851 -0.215923 0.161817 -0.256640 -0.310683 0.267127 0.253785 -0.461349 -0.390903 0.283145 0.286005 0.288556 0.268226 0.337067 0.335586 0.219090 0.334983 0.315637 0.315849 0.336394
chargesum: 0.00000
title: Mulliken charges with hydrogens summed into heavy atoms:
elementType: S S O O N N N N N N N C C C C C C C C C C
charge: 0.949254 0.364826 -0.538304 -0.540271 -0.045938 -0.044253 0.010585 -0.040320 -0.290288 0.019564 0.020086 -0.042343 0.068293 0.070081 0.161817 0.031917 -0.042458 0.267127 0.253785 -0.242259 -0.390903
polarizability: 4.45449255e+02 2.13565622e+00 2.16618855e+02 -1.30998227e+01 8.05525731e-01 1.08311204e+02
1716.lowfreq: -3.4853 0.0007 0.0017 0.0020 3.7905 7.0717 8.8537 14.8902 25.0813
frequency: 7.7720 14.8526 25.0805 29.9276 51.4444 89.4547 104.0417 121.4149 136.8273 139.7317 164.0725 175.7604 187.5997 203.6397 212.4574 238.6652 267.9981 285.7712 303.1455 311.8827 344.8000 385.9148 400.8338 403.9841 408.1583 415.9608 431.6830 448.5570 470.2566 485.6301 499.9112 523.1434 541.9276 543.7623 573.1400 578.4060 615.0154 630.8928 670.7426 729.3661 741.7635 745.4682 790.9129 805.1959 828.1832 842.2145 850.3379 869.0977 887.3334 907.1169 907.8401 974.1883 983.5790 991.3027 996.6216 1019.5993 1046.4879 1056.4553 1069.0801 1108.0166 1141.8574 1184.6768 1242.7014 1271.4508 1283.3174 1322.2422 1357.3752 1388.9272 1402.5494 1422.1399 1456.9718 1487.2816 1520.8381 1533.8810 1578.6054 1587.7764 1595.7086 1619.4483 1623.5392 3153.8842 3154.6545 3159.6129 3172.5105 3179.3679 3368.7428 3537.1174 3551.3458 3553.1533 3707.0001 3707.2082
redmass: 6.7632 6.0010 7.3459 3.3334 8.1195 8.4224 1.5393 6.3886 8.7923 9.5087 7.5397 4.9315 6.6356 6.3831 7.8179 8.1947 2.6002 6.2076 9.1722 3.7049 6.6681 5.9481 7.4711 1.1768 1.1791 3.1476 10.5025 4.5198 3.8036 5.1652 1.1569 1.0617 3.0203 5.8392 6.3956 8.0975 7.1349 4.2649 11.9970 5.5036 3.6207 2.9415 2.0434 5.3211 2.2353 7.7829 1.2472 1.5456 5.2108 4.1743 8.2764 3.7815 1.3859 4.7261 1.3781 1.8003 2.4406 1.3643 1.4715 1.3005 1.9357 1.7727 1.8583 6.4902 1.2689 5.4163 11.0203 7.6028 3.7316 5.1574 2.2445 4.0187 5.2648 1.0854 6.5165 2.2327 7.4436 1.8215 1.4112 1.0885 1.0930 1.0891 1.0968 1.0974 1.0414 1.1003 1.0448 1.0452 1.1047 1.1047
irintensity: 0.6244 0.1626 0.6826 3.6939 2.6978 3.8213 35.0758 4.4026 7.4982 2.7259 1.7345 7.7259 8.0929 0.0741 9.9985 12.0190 2.4247 15.0253 0.8390 34.6179 13.9308 3.0240 56.3529 167.7760 115.9603 2.2129 17.6498 24.7678 146.7579 19.0656 311.0088 0.9288 69.0120 5.7887 3.9539 166.8848 0.0394 3.6873 0.0324 60.0761 20.0578 9.8412 49.9439 189.8241 66.9527 57.8879 2.0899 62.8271 58.4833 51.0522 13.0778 8.8685 1.3057 2.3607 0.2418 75.1795 38.2969 0.6521 28.9798 1.6072 1.5691 1.1036 50.6423 569.1838 8.3106 28.2458 205.7326 3.6898 18.7768 9.2999 35.9161 351.2243 222.2959 20.7312 0.6792 178.8472 2.1527 819.9283 179.0901 2.0384 18.6378 1.3729 0.0963 1.4050 32.6502 25.6529 147.8422 36.4261 13.2272 62.2258
temp: 298.150 k
press: 1.00000 atm
elementType: 16 16 8 8 7 7 7 7 7 7 7 6 6 6 6 6 6 6 6 6 6 1 1 1 1 1 1 1 1 1 1 1
symmnumber: 1
zpe: 573372.0 jmol-1
zpe.correction: 0.218386 hartree
zpe.thermalcorrener: 0.240127 hartree
zpe.thermalcorrenthalpy: 0.241071 hartree
zpe.thermalcorrgfe: 0.163559 hartree
zpe.sumelectzpe: -1715.756443 hartree
zpe.sumelectthermal: -1715.734702 hartree
zpe.sumelectthermalent: -1715.733758 hartree
zpe.sumelectthermalfe: -1715.811270 hartree
dipole: -6.5510 3.3039 2.8732
dipole: 7.8796
quadrupole: -99.2365 -125.3646 -140.2342
quadrupole: -28.2625 16.0725 1.7899
quadrupole: 22.3753 -3.7528 -18.6225 -28.2625 16.0725 1.7899
hfenergy: -1715.9748289 hartree
pointgroup: C01 [X(C10H11N7O2S2)]
dipole: -2.5156641 -0.5171322 -1.7361937 debye
polarizability: 444.2338013|-10.9551511|186.6454692|21.5488278|48.0859442|139.5000429 unknown
InChI: InChI=1S/C10H11N7O2S2/c11-8-5-9(12)15-10(14-8)20-17-16-6-1-3-7(4-2-6)21(13,18)19/h1-5H,11-13H2
charge 0 multiplicity 1
32 atoms
S  5.7612 -0.571092 0.052437
S  -2.472114 1.602755 1.201667
O  6.693595 -0.231064 1.343645
O  5.640796 -2.056028 -0.607572
N  6.315943 0.556625 -1.292574
N  0.151189 1.42341 1.338714
N  -3.076289 -0.826301 0.017633
N  -4.804482 0.883503 0.145708
N  -0.833371 0.836881 0.748412
N  -3.476855 -2.913296 -0.939046
N  -6.974071 0.513663 -0.626048
C  4.016466 0.029971 0.423276
C  2.951743 -0.577974 -0.266938
C  3.855792 1.038093 1.386289
C  1.444665 0.891576 0.976909
C  1.645601 -0.140164 0.016245
C  2.542425 1.472497 1.660695
C  -3.975632 -1.674328 -0.600861
C  -5.700829 0.018256 -0.449607
C  -5.318919 -1.289483 -0.852849
C  -3.558246 0.389374 0.334623
H  3.149001 -1.381612 -0.983588
H  4.721272 1.449828 1.914112
H  0.777199 -0.575878 -0.486904
H  2.34307 2.255335 2.398249
H  7.153608 1.062638 -0.960319
H  6.488455 -0.011301 -2.138547
H  -6.028878 -1.97073 -1.330284
H  -2.5068 -3.114154 -0.705346
H  -4.05266 -3.621777 -1.384028
H  -7.708768 -0.037253 -1.059767
H  -7.16361 1.463428 -0.313034
