program: Gaussian 09
title: 000264150
version: EM64L-G09RevD.01
frameworkgroup: C1[X(C11H4BrCl2NO)]
method: RPBEPBE
basis: SDD
operation: Freq
keyword: #p
keyword: freq=noraman
keyword: PBEPBE/SDD
title: #p freq=noraman PBEPBE/SDD
converged: NO YES NO NO
title: Mulliken charges:
elementType: Br Cl Cl O N C C C C C C C C C C C H H H H
charge: 0.041262 0.002688 0.012173 -0.208804 0.047172 0.497340 0.426459 -0.073432 -0.417143 -0.070691 -0.380968 -0.364048 -0.282677 -0.112852 -0.097673 -0.141280 0.278252 0.266963 0.295694 0.281566
chargesum: 0.00000
title: Mulliken charges with hydrogens summed into heavy atoms:
elementType: Br Cl Cl O N C C C C C C C C C C C
charge: 0.041262 0.002688 0.012173 -0.208804 0.047172 0.497340 0.426459 -0.073432 -0.138891 -0.070691 -0.114005 -0.364048 0.013017 -0.112852 -0.097673 0.140285
polarizability: 3.15220649e+02 -1.27322803e+01 1.66121065e+02 5.76004277e-03 1.11783463e-02 5.70951728e+01
1716.lowfreq: -0.1525 0.0015 0.0021 0.0034 4.9581 8.1800 44.6544 70.6682 82.9853
frequency: 44.6488 70.6679 82.9852 131.1444 174.2520 187.1738 199.8193 250.8252 285.9225 320.6341 335.5052 344.4726 375.4741 418.6425 447.8994 477.7512 506.5271 548.0977 570.6649 637.3287 640.6294 658.1882 720.5470 725.4942 748.6696 781.6212 791.7540 843.1761 861.6883 890.9210 925.4517 926.9239 930.3344 1031.9029 1096.7993 1099.1883 1196.9237 1213.8767 1234.4585 1251.3820 1273.4329 1350.7287 1398.4017 1417.6260 1427.5409 1474.3218 1519.8818 1564.1488 1605.0866 1618.2994 3152.7084 3154.8133 3181.9968 3266.9775
redmass: 18.8327 9.0094 25.0013 7.3837 16.3558 24.5054 7.0154 8.0879 15.2641 10.9829 14.2823 6.3378 7.1939 3.9952 8.6167 3.4187 6.5495 8.6231 4.6576 8.0682 7.9301 8.9129 7.9935 4.8720 7.3225 3.2078 1.5146 4.7578 1.4169 1.5662 7.5633 1.5665 8.3121 9.7959 2.5571 2.1314 1.5301 6.0826 1.3888 2.4458 4.2713 2.7080 6.1316 4.4458 8.4604 7.7774 6.6341 10.4199 7.8986 8.6116 1.0928 1.0931 1.0931 1.1011
irintensity: 0.0017 0.0637 0.0610 0.5722 0.3940 0.0236 1.0336 0.2504 0.2220 1.9581 2.9643 4.8446 0.5527 3.6886 6.7913 3.1015 7.4853 40.9406 21.5072 0.7657 10.2452 10.5056 0.3007 0.0024 24.7032 9.2046 19.0535 7.9959 1.8153 14.2880 86.3801 52.7558 41.6909 86.8226 30.4004 85.3204 2.2857 10.8835 7.9395 50.9345 27.9634 26.9706 29.0788 77.3109 13.1864 58.1512 8.7163 21.7847 19.2508 11.8408 0.7655 1.6604 1.7566 5.6491
temp: 298.150 k
press: 1.00000 atm
elementType: 35 17 17 8 7 6 6 6 6 6 6 6 6 6 6 6 1 1 1 1
symmnumber: 1
zpe: 313339.8 jmol-1
zpe.correction: 0.119345 hartree
zpe.thermalcorrener: 0.132202 hartree
zpe.thermalcorrenthalpy: 0.133146 hartree
zpe.thermalcorrgfe: 0.077897 hartree
zpe.sumelectzpe: -1484.020703 hartree
zpe.sumelectthermal: -1484.007847 hartree
zpe.sumelectthermalent: -1484.006902 hartree
zpe.sumelectthermalfe: -1484.062151 hartree
dipole: -2.6385 -1.7022 -0.0003
dipole: 3.1399
quadrupole: -115.6601 -114.9428 -116.2509
quadrupole: -0.2395 0.0000 0.0001
quadrupole: -0.0422 0.6751 -0.6330 -0.2395 0.0000 0.0001
hfenergy: -1484.1400482 hartree
pointgroup: C01 [X(C11H4Br1Cl2N1O1)]
dipole: -0.9265987 0.8169982 0.0001002 debye
dipolederiv: -0.2931534 0.2039711 0.0000263 0.3996357 -0.3333337 -0.0000446 0.0000469 -0.0000413 0.0317634 -0.635702 -0.2648844 -0.0000215 -0.4606902 -0.2732497 -0.0000218 -0.0000435 -0.0000243 -0.0242268 -0.7949475 0.2425069 0.0000337 0.3948191 -0.1854886 -0.0000216 0.0000471 -0.0000195 -0.0201167 -1.0412766 0.3925072 0.0000533 -0.1577465 -0.5910302 -0.0000458 -0.0000176 -0.000056 -0.1599695 -0.6165833 0.0888442 0.0000103 0.1564651 -0.3677291 -0.0000185 0.0000222 -0.0000191 -0.2006198 -0.0711021 0.0650068 0.0000086 0.2283527 -0.1709756 -0.0000278 0.0000267 -0.0000253 0.0601871 0.1610719 0.1261898 0.0000128 -0.1430803 -0.4354246 -0.0000585 -0.0000203 -0.0000594 0.1101323 0.4899823 0.0655402 0.0000019 -0.1855623 0.1128645 0.000012 -0.0000263 0.0000077 0.0244752 0.2469749 -0.0637369 -0.0000121 -0.0675911 0.1703507 0.0000325 -0.0000124 0.0000338 -0.1321735 0.8039818 -0.1113264 -0.0000135 0.6397573 0.338456 0.0000123 0.0000777 0.0000227 0.1427976 -0.1565324 -0.1528859 -0.0000158 0.0082898 -0.0386846 0.0000065 0.0000012 0.0000075 -0.1005651 0.3783443 -0.6188381 -0.0000747 -0.8454106 0.5472644 0.0000916 -0.0000981 0.0000852 -0.197573 -0.347501 0.0733194 0.0000096 -0.0240231 -0.0229089 0.0000066 -0.000002 0.0000061 -0.0840099 0.6659572 0.65493 0.0000618 0.7991159 0.3801548 0.0000379 0.0000773 0.0000401 -0.0488301 0.9431112 -0.586354 -0.0000709 -0.6630597 0.2542489 0.0000404 -0.0000754 0.0000387 -0.0586565 -0.0338472 -0.145375 -0.0000175 -0.1237137 0.5070685 0.0000638 -0.0000143 0.0000669 -0.0412602 0.0830638 -0.0011053 0.0000007 0.0230181 -0.0205461 -0.0000194 0.0000047 -0.0000195 0.1564046 0.0649355 0.042485 0.0000056 -0.013344 -0.0168125 -0.0000194 -0.0000001 -0.0000197 0.1638846 0.0885115 -0.0196801 -0.0000012 0.0266443 0.0359705 -0.0000144 0.0000034 -0.0000133 0.1675935 0.0647113 0.0088854 0.0000025 0.0081236 0.1098056 -0.000012 0.0000028 -0.000011 0.2107629 unknown
polarizability: 315.660428|-9.8156388|165.6812868|-0.004029|0.0119122|57.0951728 unknown
InChI: InChI=1S/C11H4BrCl2NO/c12-7-4-16-11-6(7)1-5-2-8(13)9(14)3-10(5)15-11/h1-4H
charge 0 multiplicity 1
20 atoms
Br -4.374669 2.169839 0.000298
Cl 4.385169 1.901204 0.000162
Cl 4.659111 -1.356756 -0.000188
O  -2.902791 -1.743494 -0.000159
N  -0.506505 -1.641373 -0.000162
C  0.463202 0.664887 0.000074
C  -1.941308 0.391991 0.000073
C  0.591617 -0.788739 -0.000086
C  -0.841109 1.254196 0.000152
C  -1.677453 -1.030432 -0.00008
C  1.656238 1.456976 0.000145
C  -3.384512 0.517466 0.000106
C  1.893906 -1.376954 -0.000165
C  2.910148 0.854953 0.000064
C  3.030481 -0.57377 -0.000092
C  -3.918798 -0.752487 -0.000032
H  -0.96397 2.342013 0.00027
H  1.582158 2.549291 0.000264
H  1.968571 -2.467216 -0.000281
H  -4.938286 -1.127296 -0.000064
