program: Gaussian 09
title: 000264198
version: EM64L-G09RevD.01
frameworkgroup: C1[X(C16H17NO2S2)]
method: RPBEPBE
basis: SDD
operation: Freq
keyword: #p
keyword: freq=noraman
keyword: PBEPBE/SDD
title: #p freq=noraman PBEPBE/SDD
converged: YES YES NO NO
title: Mulliken charges:
elementType: S S O O N C C C C C C C C C C C C C C C C H H H H H H H H H H H H H H H H H
charge: 0.881896 0.488096 -0.573021 -0.559466 -0.540868 -0.024065 0.454746 -0.232789 -0.242828 -0.106260 -0.382719 -0.351938 -0.802847 -0.208988 -0.267978 -0.456664 -0.233968 -0.207761 -0.219683 -0.002926 -0.734966 0.273106 0.284387 0.238678 0.239272 0.334844 0.257698 0.239822 0.226907 0.230488 0.276732 0.241411 0.237630 0.235265 0.301155 0.235507 0.250502 0.221595
chargesum: 0.00000
title: Mulliken charges with hydrogens summed into heavy atoms:
elementType: S S O O N C C C C C C C C C C C C C C C C
charge: 0.881896 0.488096 -0.573021 -0.559466 -0.540868 -0.024065 0.454746 0.040317 0.041559 -0.106260 -0.144042 -0.112666 -0.105629 0.125856 -0.010280 -0.179932 0.007443 0.029869 0.015582 0.298228 -0.027363
polarizability: 3.14265996e+02 -1.81184132e+01 2.61686585e+02 4.94190898e+00 -4.61319459e+00 1.64965773e+02
1716.lowfreq: -12.8577 -6.4703 -4.4685 0.0020 0.0023 0.0027 5.9144 9.6538 17.8606
frequency: -9.4422 9.2994 17.2898 25.1473 37.5640 50.4353 69.8380 85.9322 94.5079 117.1639 127.4012 148.3905 154.6467 190.1283 197.6147 220.0471 225.5446 257.3038 272.1603 285.8975 307.2302 324.7360 350.4559 381.2334 390.9142 400.2528 406.3525 416.1911 455.2858 482.3199 501.4076 527.0106 590.1721 605.9565 620.2772 622.6756 648.2426 677.4288 690.1684 710.4366 740.3431 757.2031 771.1431 789.4839 825.3310 848.4619 849.5894 890.7838 929.9636 953.0878 959.5233 959.8161 975.0331 980.4715 983.0681 987.9931 996.6867 1002.7912 1006.5270 1048.4756 1051.5106 1052.9414 1056.0749 1080.2243 1098.9491 1116.3377 1174.2670 1182.2217 1193.9236 1211.8885 1218.0144 1294.7457 1318.7199 1320.2493 1378.4782 1381.2966 1390.1405 1391.0487 1397.6898 1429.9765 1456.2624 1459.4941 1463.4757 1470.8213 1473.9535 1474.5168 1578.4091 1591.0104 1596.7257 1597.1219 1640.1433 2978.0909 2978.9906 3059.7029 3060.4945 3069.2519 3089.5880 3097.6758 3113.9390 3132.2415 3132.3165 3134.4127 3141.9608 3152.4312 3154.5173 3162.1330 3165.1359 3168.4608
redmass: 1.1516 3.6835 3.6226 4.1748 5.1461 3.1755 3.7612 4.6144 5.1032 2.2044 5.0466 6.4719 7.4524 4.4841 1.4396 3.9741 5.4911 4.5442 7.1095 5.4248 4.4496 5.3076 6.8112 4.3375 8.8288 2.8378 2.8534 9.3542 5.9342 3.7141 6.3636 4.9013 6.2479 6.6764 11.3138 7.3658 6.7334 4.1236 2.3202 3.2581 1.4854 1.5095 6.3388 8.1613 1.3617 1.2582 1.2544 10.8348 1.3808 1.2807 1.3373 1.3245 2.3753 1.3769 2.1233 1.4672 4.5658 1.3836 4.6734 1.5849 1.5803 1.9771 2.4286 1.6283 2.2439 1.2803 1.0564 1.1442 1.1320 1.2296 2.9729 1.2654 1.2441 1.2255 9.2165 5.5364 1.2179 2.9767 1.2575 2.1315 1.0466 1.9169 1.0866 1.0796 2.3968 1.0746 5.6451 6.3855 6.6499 6.3678 5.2285 1.0358 1.0384 1.0969 1.0955 1.0953 1.0997 1.0999 1.0939 1.0895 1.0859 1.0894 1.0908 1.0953 1.0957 1.0951 1.0962 1.1014
irintensity: 1.2403 0.9023 0.6698 0.7019 3.1074 0.5985 0.9938 0.5402 0.4657 1.5064 4.9356 0.6949 4.1254 3.0439 1.6691 3.3793 11.6388 2.0064 13.6334 10.4701 3.5254 3.5478 2.6929 3.8183 24.7280 0.8427 0.0384 32.8809 72.5165 27.8874 25.9750 72.5127 27.1863 3.3645 81.3713 9.7939 0.2443 7.8149 44.8372 1.1792 21.4967 60.9317 27.2711 39.2208 37.1561 5.0447 4.6488 109.0058 4.8054 34.9335 25.2596 19.2017 2.5469 0.3436 4.5919 1.4392 7.2682 0.9438 2.3738 17.5529 3.9247 10.1010 23.8165 5.8420 7.2251 8.0791 0.2385 18.1751 7.8654 21.6134 5.6121 2.3874 4.3346 8.3542 3.5285 0.9066 10.5970 8.6137 13.2557 13.2656 14.4262 20.1862 27.7869 15.2801 27.2119 13.9719 5.6554 1.4290 3.3325 4.6294 4.9696 23.8457 31.1120 11.7571 20.8990 35.5154 15.9635 8.0808 46.3282 16.7500 1.1041 11.9315 0.5414 5.2305 17.2802 1.6346 12.2495 40.5318
temp: 298.150 k
press: 1.00000 atm
elementType: 16 16 8 8 7 6 6 6 6 6 6 6 6 6 6 6 6 6 6 6 6 1 1 1 1 1 1 1 1 1 1 1 1 1 1 1 1 1
symmnumber: 1
zpe: 749357.6 jmol-1
zpe.correction: 0.285415 hartree
zpe.thermalcorrener: 0.307403 hartree
zpe.thermalcorrenthalpy: 0.308347 hartree
zpe.thermalcorrgfe: 0.230497 hartree
zpe.sumelectzpe: -1619.422334 hartree
zpe.sumelectthermal: -1619.400346 hartree
zpe.sumelectthermalent: -1619.399402 hartree
zpe.sumelectthermalfe: -1619.477252 hartree
dipole: 2.2199 -3.0184 -1.4110
dipole: 4.0037
quadrupole: -100.7678 -125.5470 -144.3108
quadrupole: 3.8599 1.9893 -3.2249
quadrupole: 22.7740 -2.0051 -20.7689 3.8599 1.9893 -3.2249
hfenergy: -1619.7077496 hartree
pointgroup: C01 [X(C16H17N1O2S2)]
dipole: 0.816561 1.3417195 0.1191194 debye
polarizability: 309.2595121|16.208203|253.6184385|-21.7951436|-32.1484182|178.040404 unknown
InChI: InChI=1S/C16H17NO2S2/c1-3-13-20(15-7-5-4-6-8-15)17-21(18,19)16-11-9-14(2)10-12-16/h3-13H,1-2H3
charge 0 multiplicity 1
38 atoms
S  -0.500862 -1.105488 -0.292888
S  2.108768 0.072327 1.036073
O  0.050988 -0.709628 -1.790582
O  -0.642333 -2.702799 0.068325
N  0.341296 -0.16194 1.126594
C  -2.217046 -0.360553 -0.073063
C  -4.788973 0.712808 0.212388
C  -2.51081 0.846084 -0.725536
C  -3.147723 -1.06119 0.709331
C  2.736907 1.264333 -0.312042
C  -3.812251 1.375089 -0.57762
C  -4.441071 -0.510837 0.844239
C  -6.175775 1.304754 0.389868
C  2.505499 1.055569 -1.685791
C  3.444667 2.381565 0.179898
C  3.055905 -1.466109 0.522136
C  3.02771 2.004496 -2.596417
C  3.962364 3.317588 -0.746533
C  3.755626 3.126182 -2.132359
C  2.511573 -2.701372 0.512925
C  3.291088 -3.942609 0.147413
H  -1.756101 1.339859 -1.345738
H  -2.868235 -2.013525 1.170921
H  -4.071434 2.313101 -1.081933
H  -5.189203 -1.039374 1.446653
H  1.902149 0.205557 -2.026519
H  3.590088 2.522981 1.256461
H  -6.261097 1.823204 1.364462
H  -6.407203 2.041749 -0.398107
H  -6.955538 0.522779 0.367701
H  4.093479 -1.211008 0.280986
H  2.856232 1.865839 -3.669304
H  4.518378 4.188636 -0.383803
H  4.154033 3.85349 -2.848436
H  1.443224 -2.843426 0.738715
H  3.262627 -4.670288 0.980615
H  2.817064 -4.435235 -0.722231
H  4.34519 -3.727607 -0.097102
