program: Gaussian 09
title: 000264151
version: EM64L-G09RevD.01
frameworkgroup: C1[X(C11H9BrO2S)]
method: RPBEPBE
basis: SDD
operation: Freq
keyword: #p
keyword: freq=noraman
keyword: PBEPBE/SDD
title: #p freq=noraman PBEPBE/SDD
converged: YES YES NO NO
title: Mulliken charges:
elementType: Br S O O C C C C C C C C C C C H H H H H H H H H
charge: 0.026671 -0.018560 -0.240343 -0.194453 0.291499 -0.462172 0.400465 -0.425278 0.157043 0.049775 -0.736974 -0.320906 -0.330687 -0.253948 -0.160581 0.230279 0.242617 0.261264 0.309380 0.273389 0.262208 0.274456 0.260242 0.104613
chargesum: 0.00000
title: Mulliken charges with hydrogens summed into heavy atoms:
elementType: Br S O O C C C C C C C C C C C
charge: 0.026671 0.086053 -0.240343 -0.194453 0.291499 0.010725 0.400465 -0.164013 0.157043 0.049775 -0.154206 -0.058698 -0.056231 -0.253948 0.099661
polarizability: 2.98547220e+02 1.05191420e+01 1.44632886e+02 1.21209390e+01 -6.03432987e+00 7.28786904e+01
1716.lowfreq: -9.0483 -0.8908 0.0007 0.0009 0.0019 3.6350 32.9570 53.7655 61.2897
frequency: 32.8988 53.7559 61.2771 82.7797 138.0560 142.2533 156.9973 193.5200 215.0348 247.1069 281.3020 297.2999 341.9226 349.0090 410.7224 455.7574 480.0799 482.8414 552.9922 569.0492 615.0490 663.6071 687.3004 715.6684 733.4058 739.3150 765.7850 823.3052 825.6861 843.4432 874.3021 894.5521 933.7194 954.1250 959.6312 1020.8608 1035.0186 1062.1425 1124.9160 1153.7958 1177.2546 1208.3798 1244.7685 1253.7435 1267.1028 1278.1184 1318.7195 1355.5602 1392.2694 1410.4135 1445.1666 1459.3442 1463.6331 1553.1965 1599.0183 1623.0956 1660.5810 2437.3970 3003.6151 3044.1901 3069.2279 3124.3219 3128.9051 3159.0236 3167.3845 3185.8791
redmass: 7.4003 5.3172 4.6723 2.7667 6.0499 6.9148 8.1385 1.3781 3.9361 14.1660 2.9749 4.9332 6.0322 5.2967 4.7043 3.1871 7.7510 7.3769 6.2456 3.9583 7.0419 5.8194 5.2189 3.8764 1.9217 2.2176 4.6775 1.9984 1.4434 2.0761 1.3973 6.3453 1.6819 4.5877 1.3799 3.1165 1.9174 2.1397 1.6111 1.5364 1.5327 2.5121 2.3275 1.1967 1.4351 1.1855 1.3069 2.1731 10.3575 3.3103 1.0801 1.1059 3.1124 7.5021 7.8844 7.2684 11.6056 1.0383 1.0601 1.0580 1.1021 1.1077 1.0929 1.0929 1.0890 1.0978
irintensity: 0.5018 0.3720 0.6414 4.8688 1.5594 3.3216 0.8199 19.5241 10.9281 1.6065 1.7622 0.9306 5.1284 1.1188 2.8381 6.0183 17.1294 2.7307 11.9340 10.0355 9.2345 10.9583 1.5687 14.4946 10.2642 2.4000 21.6299 40.7762 52.0569 21.0163 3.3092 33.5693 24.1842 87.6441 6.0789 17.5045 12.9649 17.7461 13.6973 6.7268 16.8652 29.8096 68.0246 4.1060 6.1262 1.3865 11.9048 7.0196 0.7199 56.3783 2.2342 17.1336 46.4061 50.7443 38.6950 0.5388 461.6622 22.2490 11.8907 14.1563 4.1898 4.0320 11.0930 1.1956 0.1516 0.9903
temp: 298.150 k
press: 1.00000 atm
elementType: 35 16 8 8 6 6 6 6 6 6 6 6 6 6 6 1 1 1 1 1 1 1 1 1
symmnumber: 1
zpe: 442621.8 jmol-1
zpe.correction: 0.168586 hartree
zpe.thermalcorrener: 0.182788 hartree
zpe.thermalcorrenthalpy: 0.183732 hartree
zpe.thermalcorrgfe: 0.125129 hartree
zpe.sumelectzpe: -985.469329 hartree
zpe.sumelectthermal: -985.455128 hartree
zpe.sumelectthermalent: -985.454184 hartree
zpe.sumelectthermalfe: -985.512786 hartree
dipole: -2.4501 -1.4235 0.6885
dipole: 2.9161
quadrupole: -117.8944 -109.0582 -105.4877
quadrupole: -6.0491 5.6967 -2.5602
quadrupole: -7.0809 1.7552 5.3257 -6.0491 5.6967 -2.5602
hfenergy: -985.6379152 hartree
pointgroup: C01 [X(C11H9Br1O2S1)]
dipole: -0.9070509 -0.5826673 0.3923939 debye
dipolederiv: -0.6002861 -0.2545121 0.0531369 -0.368856 -0.2161226 0.042386 0.074705 0.0413444 -0.0302536 -0.4509913 0.096186 0.114084 0.0546804 0.0837175 0.0966012 0.0777885 0.1387358 -0.210517 -1.3798769 -0.3309611 0.0538908 0.095039 -0.3685583 0.0372228 -0.0718493 0.0366145 -0.2009274 -1.2319368 -0.3349387 0.069969 -0.6569616 -0.7630419 0.0777262 0.1626215 0.0790724 -0.3364582 0.0962307 -0.1697046 0.023473 -0.6475034 -0.309725 0.0594693 0.3241082 0.0256836 -0.1166009 -0.2815497 0.0566236 0.0594526 0.0719247 0.0707757 -0.0247042 0.1798471 -0.0132741 0.0229205 -0.2825875 -0.020545 -0.0057674 0.1263005 -0.1048486 0.0435441 -0.0822485 0.0427212 0.0239579 0.4240961 0.1257172 0.0132661 -0.1495247 0.1662473 -0.0755242 0.0535508 -0.0642949 -0.0669124 0.571263 0.3153916 -0.057658 0.2501819 0.2264696 -0.0185694 -0.0460734 -0.0138598 0.1223364 1.8250373 0.4275436 -0.0670099 0.7503457 0.9879028 -0.1496058 -0.1678824 -0.1638854 0.2935006 0.5805602 -0.1578236 -0.0553915 -0.0115869 0.060514 0.0393256 -0.230079 0.033353 0.1273558 -0.1048508 -0.1180221 0.0345241 -0.1018133 -0.0096878 -0.0266917 0.0235256 -0.0242583 -0.0771448 -0.0602849 -0.0825026 0.0200937 -0.0932572 0.0385643 -0.0484013 0.030346 -0.0544514 -0.138396 0.9209073 0.566709 -0.1185244 0.9377607 0.2962109 -0.0937722 -0.2006966 -0.0935207 -0.1207269 -0.3445661 -0.1697725 0.0471197 -0.2995854 -0.0450406 -0.0170326 0.0689635 -0.0159974 -0.0764445 0.0367077 -0.0219756 0.0256143 0.0273373 -0.0556376 0.0966255 0.0077863 0.0568832 0.0245636 -0.0186184 -0.0261784 -0.0662858 -0.0434288 0.0267676 -0.0792675 -0.0456287 -0.0352235 0.0311249 0.084996 0.0027624 -0.0063951 0.0630423 -0.0488386 0.0490824 -0.0066096 0.0451892 0.1143183 0.0148549 0.0522264 -0.0166273 0.0061532 -0.026737 0.0949284 -0.0216855 0.0322511 0.038794 -0.0027542 -0.0451844 -0.0598663 -0.0118435 0.0258421 -0.0895817 -0.0128373 -0.0609584 0.0182572 0.0993639 0.0326098 -0.0120426 -0.0008172 -0.0155211 0.0454303 -0.0038179 0.0473422 0.1452189 0.0760164 -0.0258255 0.0032825 0.0046111 -0.0002881 0.0457065 -0.0058834 0.0454032 0.164771 -0.0145988 0.0529174 -0.0199267 0.0396474 0.0903316 0.0199838 -0.0172188 0.020363 0.1544044 0.0428679 0.0292592 -0.0324116 -0.0418465 -0.1092961 -0.1248813 -0.0907319 -0.1052328 0.0928584 unknown
polarizability: 297.4306406|18.3413915|144.6229101|-6.209396|-13.0558016|74.0052451 unknown
InChI: InChI=1S/C11H9BrO2S/c12-9-1-2-10-8(6-9)5-7(3-4-15)11(13)14-10/h1-2,5-6,15H,3-4H2
charge 0 multiplicity 1
24 atoms
Br -4.999901 -1.665518 0.358412
S  5.408253 -1.737216 -0.712302
O  0.10728 1.694633 -0.323059
O  2.393509 1.952052 -0.308228
C  1.543213 -0.26065 0.239278
C  2.944524 -0.809038 0.423886
C  -0.922526 -0.473212 0.200577
C  0.40321 -1.022796 0.397907
C  -1.031822 0.900774 -0.161844
C  1.443043 1.162892 -0.138165
C  3.683845 -0.97807 -0.927253
C  -2.116178 -1.23393 0.354727
C  -2.284449 1.513542 -0.369346
C  -3.357657 -0.617597 0.146685
C  -3.457597 0.75036 -0.214549
H  2.905919 -1.785472 0.938702
H  3.529317 -0.115538 1.05697
H  0.496745 -2.077515 0.684259
H  3.790795 -0.013415 -1.445769
H  3.15612 -1.686306 -1.586969
H  -2.053347 -2.290339 0.633601
H  -2.327224 2.57011 -0.646822
H  -4.43694 1.210084 -0.371892
H  5.978267 -0.631235 -0.102405
